{"text_format":"1","workbook":"xlsx","n_sheets":8,"sheets":["Instructions","Input","Output","Species Codes","Version","Calculations","References","Specific Gravity"],"not_rendered":{"charts":0,"images":0,"macros":1,"external_links":0,"defined_names":0,"comments":0,"pivot_tables":0},"unopened":[],"bounds":{"document_bytes":16777216,"sheet_cells":100000,"rows_first":2000,"rows_last":500,"rows_between":2000,"halvings":0,"cell_chars":16384,"cell_head_chars":4096},"cells_cut":0,"cells_raw":0,"read":"whole","date_system":"1900"}

{"sheet":"Instructions","index":0,"n_rows":42,"n_cols":3,"rows_kept":42,"cut":false,"hidden":false,"merged":[[1,0,1,10],[25,2,26,10],[30,2,32,10],[36,2,37,10],[41,2,42,10],[5,2,7,10],[13,2,15,10],[17,2,19,10],[21,2,23,10]]}
[]
["Line Intersect Calculator - Instructions"]
[]
["Input Sheet"]
[]
[null,null,"If there is data in the sheet, click on the \"Clear Data\" button to delete the information. You do not need to go through this step for the calculation but if you don't, make sure all the data already entered is pertinent to the calculation."]
[]
[]
[]
[null,null,"Enter the slope of the line for which you want to make the calculation. If zero, put 0."]
[]
[null,null,"The diameter classes used in the sampling must correspond to the ones indicated on the form."]
[]
[null,null,"Enter the length of the line used for each diameter class. If classes were not dropped as you progressed with the line intersect sampling, the same length should be entered for each diameter class."]
[]
[]
[]
[null,null,"Enter the percent composition of the five main species represented in the dead and downed woody debris. The total must be 100.0 %. You must use the species code presented in the worksheet \"Species Codes\"."]
[]
[]
[]
[null,null,"Enter the detailed information for the large diameter woody debris and coarse woody debris: species code and diameter. You must use the species code presented in the worksheet \"Species Codes\"."]
[]
[]
[]
[null,null,"The data will be calculated automatically and presented on the \"Output\" worksheet when all the required information has been entered."]
[]
[]
["Species Codes"]
[]
[null,null,"This worksheet is there as a reference to enter a standard code for the species present on your sample line. The right code must be used each time (case sensitive) or the calculation will be wrong."]
[]
[]
[]
["Output Sheet"]
[]
[null,null,"The results of the calculation are presented automatically on the results sheet. If the inputs are not entered, the output values will either be absent or zero."]
[]
[]
[null,null,"You can add some text in the grey fields, as required, to document the output values."]
{"$rows_left_out":3}
{"sheet":"Input","index":1,"n_rows":45,"n_cols":10,"rows_kept":45,"cut":false,"hidden":false,"merged":[[0,0,0,10]]}
["DATA INPUT - LINE INTERSECT SAMPLING"]
[]
[1,"Slope of the sampling line (not of the terrain)"]
[]
[null,null,null,null,null,"(%)"]
[]
[2,"Length of line used for each diameter class"]
[]
[null,null,null,"≤0.5","0.6 - 1.0","1.1 - 3.0","3.1 - 5.0","5.1 - 7.0",">7.0"]
[]
[]
[3,"Number of intersections per diameter class along the sampling line (pieces diameter ≤7.0 cm)"]
[]
[null,null,null,null,"≤0.5","0.6 - 1.0","1.1 - 3.0","3.1 - 5.0","5.1 - 7.0"]
[null,null,null,null,null,null,null,null,null,"(count)"]
[null,null,null,{"$f":"SUM(E16:I16)","v":5},{"$f":"IF(OR(E15=0,E15=\"\"),1,\"\")","v":1},{"$f":"IF(OR(F15=0,F15=\"\"),1,\"\")","v":1},{"$f":"IF(OR(G15=0,G15=\"\"),1,\"\")","v":1},{"$f":"IF(OR(H15=0,H15=\"\"),1,\"\")","v":1},{"$f":"IF(OR(I15=0,I15=\"\"),1,\"\")","v":1}]
[4,"Species composition along the line (pieces diameter ≤7.0 cm)"]
[null,"Note: Maximum of 5 species. You may need to group percentages of similar species if more than 5 species"]
[null,"Note: You must use the exact code of the species (case sensitive) as pensented in the \"Species Codes\" list"]
[]
[null,null,null,null,null,null,null,null,null,"Species"]
[null,null,null,null,null,null,null,null,null,"(%)"]
[null,null,null,null,null,null,null,"Total (must be 100%):",{"$f":"SUM(E22:I22)","v":0},"(%)"]
[]
[5,"Large Diameter Woody Debris (LDWD) pieces diameter >7.0 to 20.0 cm"]
[null,"Note: You must use the exact code of the species (case sensitive) as pensented in the \"Species Codes\" list"]
[null,"Note: The diameter must be entered in centimetre (cm) and the number will display in RED if out of LDWD range."]
[]
[null,"Species","Diameter","Species","Diameter","Species","Diameter","Species","Diameter"]
[]
[]
[]
[]
[]
[]
[]
[]
[]
[]
[]
{"$rows_left_out":6}
{"sheet":"Output","index":2,"n_rows":32,"n_cols":11,"rows_kept":32,"cut":false,"hidden":false,"merged":[[12,5,12,7],[12,9,12,10],[31,3,55,10],[0,0,0,11],[4,3,4,4],[2,3,2,4],[2,9,2,10],[8,3,10,10],[6,3,6,4],[4,9,4,10]]}
["DEAD AND DOWNED WOODY MATERIAL SAMPLING"]
[]
[null,"Sampling Date:",null,null,null,null,null,"Contact Person:   "]
[]
[null,"Fire Timing:"]
[]
[null,"Plot Number:"]
[]
[null,"Location:"]
[]
[]
[]
[null,null,null,"Classes",null,"Calculation Results",null,null,null,"Sample Line Info"]
[]
[null,"Fuel Summary:",null,"Diameter",null,"Load","Load","Volume",null,"Length","Intersections"]
[null,null,null,"(cm)",null,"(t/ha)","(kg/m2)","(m3/ha)",null,"(m)","(count)"]
[]
[null,"[Select]",null,"≤0.5",null,{"$f":"IF(J18=\"\",\"\",IF(Input!$D$16>3,Calculations!P59,Calculations!D59))","v":""},{"$f":"IF(F18=\"\",\"\",F18/10)","v":""},{"$f":"IF(J18=\"\",\"\",IF(Input!D16>3,Calculations!P72,Calculations!D72))","v":""},null,{"$f":"IF(Input!D10=\"\",\"\",Input!D10)","v":""},{"$f":"IF(Input!E15=\"\",\"\",Input!E15)","v":""}]
[null,"Pre-Burn",null,"0.6 - 1.0",null,{"$f":"IF(J19=\"\",\"\",IF(Input!$D$16>3,Calculations!Q59,Calculations!E59))","v":""},{"$f":"IF(F19=\"\",\"\",F19/10)","v":""},{"$f":"IF(J19=\"\",\"\",IF(Input!D16>3,Calculations!Q72,Calculations!E72))","v":""},null,{"$f":"IF(Input!E10=\"\",\"\",Input!E10)","v":""},{"$f":"IF(Input!F15=\"\",\"\",Input!F15)","v":""}]
[null,"Post-Burn",null,"1.1 - 3.0",null,{"$f":"IF(J20=\"\",\"\",IF(Input!$D$16>3,Calculations!R59,Calculations!F59))","v":""},"",{"$f":"IF(J20=\"\",\"\",IF(Input!D16>3,Calculations!R72,Calculations!F72))","v":""},null,{"$f":"IF(Input!F10=\"\",\"\",Input!F10)","v":""},{"$f":"IF(Input!G15=\"\",\"\",Input!G15)","v":""}]
[null,"N/A",null,"3.1 - 5.0",null,{"$f":"IF(J21=\"\",\"\",IF(Input!$D$16>3,Calculations!S59,Calculations!G59))","v":""},"",{"$f":"IF(J21=\"\",\"\",IF(Input!D16>3,Calculations!S72,Calculations!G72))","v":""},null,{"$f":"IF(Input!G10=\"\",\"\",Input!G10)","v":""},{"$f":"IF(Input!H15=\"\",\"\",Input!H15)","v":""}]
[null,null,null,"5.1 - 7.0",null,{"$f":"IF(J22=\"\",\"\",IF(Input!$D$16>3,Calculations!T59,Calculations!H59))","v":""},"",{"$f":"IF(J22=\"\",\"\",IF(Input!D16>3,Calculations!T72,Calculations!H72))","v":""},null,{"$f":"IF(Input!H10=\"\",\"\",Input!H10)","v":""},{"$f":"IF(Input!I15=\"\",\"\",Input!I15)","v":""}]
[null,null,null,">7.0 - 20.0",null,{"$f":"Calculations!D77","v":""},{"$f":"IF(F23=\"\",\"\",F23/10)","v":""},{"$f":"Calculations!D78","v":""},null,{"$f":"IF(Input!I10=\"\",\"\",Input!I10)","v":""},{"$f":"IF(COUNTA(Input!B30:B39,Input!D30:D39,Input!F30:F39,Input!H30:H39)=0,\"\",COUNTA(Input!B30:B39,Input!D30:D39,Input!F30:F39,Input!H30:H39))","v":""}]
[null,null,null,">20.0",null,{"$f":"Calculations!D129","v":""},{"$f":"IF(F24=\"\",\"\",F24/10)","v":""},{"$f":"Calculations!D130","v":""},null,{"$f":"IF(Input!I10=\"\",\"\",Input!I10)","v":""},{"$f":"IF(COUNTA(Input!B46:B55,Input!D46:D55,Input!F46:F55,Input!H46:H55)=0,\"\",COUNTA(Input!B46:B55,Input!D46:D55,Input!F46:F55,Input!H46:H55))","v":""}]
[]
[null,null,null,"Total ≤7.0",null,{"$f":"IF(F18=\"\",\"\",SUM(F18:F22))","v":""},{"$f":"IF(F18=\"\",\"\",SUM(G18:G22))","v":""},{"$f":"IF(F26=\"\",\"\",SUM(H18:H22))","v":""},null,null,{"$f":"IF(F18=\"\",\"\",SUM(K18:K22))","v":""}]
[null,null,null,"Total >7.0",null,{"$f":"IF(F18=\"\",\"\",SUM(F23:F24))","v":""},{"$f":"IF(F18=\"\",\"\",SUM(G23:G24))","v":""},{"$f":"IF(F27=\"\",\"\",SUM(H23:H24))","v":""},null,null,{"$f":"IF(F18=\"\",\"\",SUM(K23:K24))","v":""}]
[null,null,null,"Total All",null,{"$f":"IF(F18=\"\",\"\",SUM(F18:F24))","v":""},{"$f":"IF(F18=\"\",\"\",SUM(G18:G24))","v":""},{"$f":"IF(F28=\"\",\"\",SUM(H18:H24))","v":""},null,null,{"$f":"IF(F18=\"\",\"\",SUM(K18:K24))","v":""}]
[]
[null,null,null,null,null,null,null,null,null,null,{"$f":"\"Slope of the line: \"&Input!E5&\"%\"","v":"Slope of the line: %"}]
[]
[null,"Comments:"]

{"sheet":"Species Codes","index":3,"n_rows":70,"n_cols":4,"rows_kept":70,"cut":false,"hidden":false,"merged":[[0,0,0,10]]}
[]
[null,"Species Codes"]
[]
[null,"Code.","Common Name","Scientific Name"]
[null,"Cw","western redcedar","Thuja plicata"]
[null,"Yc","yellow-cedar","Chamaecyparis nootkatensis"]
[null,"Fd","Douglas-fir","Pseudotsuga menziesii"]
[null,"Fdc","coastal Douglas-fir","P. menziesii var. menziesii"]
[null,"Fdi","interior Douglas-fir","P. menziesii var. glauca"]
[null,"Ba","amabilis fir","Abies amabilis"]
[null,"Bg","grand fir","A. grandis"]
[null,"Bp","noble fir","A. procera"]
[null,"Bl","subalpine fir","A. lasiocarpa"]
[null,"Hm","mountain hemlock","Tsuga mertensiana"]
[null,"Hw","western hemlock","T. heterophylla"]
[null,"Hxm","mountain x western hemlock hybrid","T. mertensiana x heterophylla"]
[null,"Jr","Rocky Mtn. juniper","Juniperus scopulorum"]
[null,"La","alpine larch","Larix lyallii"]
[null,"Lt","tamarack","L. laricina"]
[null,"Lw","western larch","L. occidentalis"]
[null,"Pj","jack pine","Pinus banksiana"]
[null,"Pf","limber pine","P. flexilis"]
[null,"Pl","lodgepole pine","P. contorta"]
[null,"Pxj","lodgepole x jack pine hybrid","P. x murraybanksiana"]
[null,"Py","ponderosa pine","P. ponderosa"]
[null,"Plc","shore pine","P. contorta var. contorta"]
[null,"Pw","western white pine","P. monticola"]
[null,"Pa","whitebark pine","P. albicaulis"]
[null,"Sb","black spruce","Picea mariana"]
[null,"Se","Engelmann spruce","P. engelmannii"]
[null,"Ss","Sitka spruce","P. sitchensis"]
[null,"Sw","white spruce","P. glauca"]
[null,"Sx","spruce hybrid","P. cross"]
[null,"Tw","western yew","Taxus brevifolia"]
[null,"Dm","mountain alder","Alnus tenuifolia"]
[null,"Dr","red alder","A. rubra"]
[null,"Dg","green and Sitka alder","A. sitchensis"]
[null,"Up","Pacific crab apple","Malus fusca"]
[null,"Ac","poplar","Populus balsamifera"]
[null,"Acb","balsam poplar","P. b. spp. balsamifera"]
{"$rows_left_out":31}
{"sheet":"Version","index":4,"n_rows":31,"n_cols":7,"rows_kept":31,"cut":false,"hidden":true,"merged":[]}
["Version 3.0"]
["For comments and changes, please contact"]
[]
["Jonathan Murkin"]
["Land and Resource Specialist"]
["MOF, BCWS"]
["jonathan.murkin@gov.bc.ca"]
[]
["Original contact info and developer credits:"]
[]
["Daniel Perrakis",null,null,null,null,null,"Please note that Daniel has left MOF. "]
["Fire Science Officer"]
["Min. FLNRO, Wildfire Mangement Branch"]
["Daniel.Perrakis@gov.bc.ca"]
["250-356-0082"]
["______________________________________________________"]
["For questions or to report problems, please contact:"]
[]
["~~~~~~~~~~~~~~~~~~~~~~~~~~~~~~~~~~~~~~~~~~~~~~"]
["Nathalie Lavoie"]
["Leader, Fire Sciences"]
["B.C. Ministry of Forests and Range - Protection Program"]
[]
["Telephone: 250-387-8716; Facsimile: 250-387-5685"]
["E-mail: Nathalie.Lavoie@gov.bc.ca"]
[null,null,null,null,null,null,"Please note that Nathalie left the Protection program in 2008. "]
["Mailing Address:"]
["PO Box 9502, Stn Prov Govt"]
["Victoria BC  V8W 9C1"]
["CANADA"]
["~~~~~~~~~~~~~~~~~~~~~~~~~~~~~~~~~~~~~~~~~~~~~~"]

{"sheet":"Calculations","index":5,"n_rows":175,"n_cols":23,"rows_kept":175,"cut":false,"hidden":true,"merged":[[80,12,80,13],[81,12,81,13],[39,19,39,20],[40,19,40,20],[39,7,39,8],[40,7,40,8],[76,12,76,13],[77,12,77,13]]}
[]
["Number of intersects per diameter class along the sampling line"]
[]
[null,null,null,"0-0.5","0.5-1.0","1.0-3.0","3.0-5.0","5.0-7.0"]
[null,null,null,{"$f":"Input!E15","v":0},{"$f":"Input!F15","v":0},{"$f":"Input!G15","v":0},{"$f":"Input!H15","v":0},{"$f":"Input!I15","v":0}]
[]
["Length of line used for each diameter class"]
[]
[null,null,null,"0-0.5","0.5-1.0","1.0-3.0","3.0-5.0","5.0-7.0"]
[null,null,null,{"$f":"Input!D10","v":0},{"$f":"Input!E10","v":0},{"$f":"Input!F10","v":0},{"$f":"Input!G10","v":0},{"$f":"Input!H10","v":0},"(m)"]
[]
["Slope of the line"]
[null,null,null,{"$f":"Input!E5","v":0},"(%)"]
[]
["Quadratic Mean Diameter Calculation"]
[null,null,"Diameter Class"]
[]
[null,null,null,"0-0.5","0.5-1.0","1.0-3.0","3.0-5.0","5.0-7.0"]
[null,"Class low",null,0,0.5,1,3,5]
[null,"Class high",null,0.5,1,3,5,7]
[]
[null,"freq",null,{"$f":"D5/D10*30","v":{"$error":"#DIV/0!"}},{"$f":"E5/E10*30","v":{"$error":"#DIV/0!"}},{"$f":"F5/F10*30","v":{"$error":"#DIV/0!"}},{"$f":"G5/G10*30","v":{"$error":"#DIV/0!"}},{"$f":"H5/H10*30","v":{"$error":"#DIV/0!"}}]
[null,"adjfreq",null,{"$f":"D22/(D20-D19)","v":{"$error":"#DIV/0!"}},{"$f":"E22/(E20-E19)","v":{"$error":"#DIV/0!"}},{"$f":"F22/(F20-F19)","v":{"$error":"#DIV/0!"}},{"$f":"G22/(G20-G19)","v":{"$error":"#DIV/0!"}},{"$f":"H22/(H20-H19)","v":{"$error":"#DIV/0!"}}]
[null,"mid-class",null,{"$f":"((D20-D19)/2)+D19","v":0.25},{"$f":"((E20-E19)/2)+E19","v":0.75},{"$f":"((F20-F19)/2)+F19","v":2},{"$f":"((G20-G19)/2)+G19","v":4},{"$f":"((H20-H19)/2)+H19","v":6}]
[null,"Ln(adjfreq)",null,{"$f":"IF(D23<0.00000001,\"\",LN(D23))","v":{"$error":"#DIV/0!"}},{"$f":"IF(E23<0.00000001,\"\",LN(E23))","v":{"$error":"#DIV/0!"}},{"$f":"IF(F23<0.00000001,\"\",LN(F23))","v":{"$error":"#DIV/0!"}},{"$f":"IF(G23<0.00000001,\"\",LN(G23))","v":{"$error":"#DIV/0!"}},{"$f":"IF(H23<0.00000001,\"\",LN(H23))","v":{"$error":"#DIV/0!"}},"y"]
[null,"Ln(mid-class)",null,{"$f":"LN(D24)","v":-1.3862943611198906},{"$f":"LN(E24)","v":-0.2876820724517809},{"$f":"LN(F24)","v":0.69314718055994529},{"$f":"LN(G24)","v":1.3862943611198906},{"$f":"LN(H24)","v":1.791759469228055},"x"]
[]
[null,"Slope (b)",null,{"$f":"SLOPE(D25:H25,D26:H26)","v":{"$error":"#DIV/0!"}}]
[]
[null,"Class low",null,0.1,0.5,1,3,5]
[null,"Class high",null,0.5,1,3,5,7]
[]
[null,"QMD2=",null,{"$f":"(($D$28+1)*((D31^($D$28+3))-(D30^($D$28+3))))/(($D$28+3)*((D31^($D$28+1))-(D30^($D$28+1))))","v":{"$error":"#DIV/0!"}},{"$f":"(($D$28+1)*((E31^($D$28+3))-(E30^($D$28+3))))/(($D$28+3)*((E31^($D$28+1))-(E30^($D$28+1))))","v":{"$error":"#DIV/0!"}},{"$f":"(($D$28+1)*((F31^($D$28+3))-(F30^($D$28+3))))/(($D$28+3)*((F31^($D$28+1))-(F30^($D$28+1))))","v":{"$error":"#DIV/0!"}},{"$f":"(($D$28+1)*((G31^($D$28+3))-(G30^($D$28+3))))/(($D$28+3)*((G31^($D$28+1))-(G30^($D$28+1))))","v":{"$error":"#DIV/0!"}},{"$f":"(($D$28+1)*((H31^($D$28+3))-(H30^($D$28+3))))/(($D$28+3)*((H31^($D$28+1))-(H30^($D$28+1))))","v":{"$error":"#DIV/0!"}}]
[null,"QMD=",null,{"$f":"SQRT(D33)","v":{"$error":"#DIV/0!"}},{"$f":"SQRT(E33)","v":{"$error":"#DIV/0!"}},{"$f":"SQRT(F33)","v":{"$error":"#DIV/0!"}},{"$f":"SQRT(G33)","v":{"$error":"#DIV/0!"}},{"$f":"SQRT(H33)","v":{"$error":"#DIV/0!"}}]
[null,"QMD_D2",null,{"$f":"((0.275+0.336+0.313+0.338)/4)^2","v":9.9540249999999997E-2},{"$f":"((0.682+0.697+0.711+0.669)/4)^2","v":0.47575506249999999},{"$f":"((1.692+1.91+1.807+1.814)/4)^2","v":3.2607330624999999},{"$f":"((3.894+3.884+3.796+3.909)/4)^2","v":14.982705562500001},{"$f":"((5.862+5.925+5.903+5.872)/4)^2","v":34.697990249999989},null,"Average from Delisle and Woodard (1988) used"]
["Slope Correction Factor",null,null,null,null,null,null,null,null,"only when only a few classes with intersections"]
[]
[null,"c=",null,{"$f":"(1+((D13/100)^2))^0.5","v":1}]
[null,null,null,null,null,null,null,null,null,null,null,null,"This section uses average QMD from Delisle and Woodard (1988)"]
["Fuel Load (<7 cm diameter)",null,null,null,null,null,"W = ","kn(QMD)2Gac",null,null,null,null,"Fuel Load (<7 cm diameter)",null,null,null,null,null,"W = ","kn(QMD)2Gac"]
{"$rows_left_out":136}
{"sheet":"References","index":6,"n_rows":56,"n_cols":7,"rows_kept":56,"cut":false,"hidden":true,"merged":[[3,1,4,8],[6,2,6,3],[7,2,7,3],[49,2,50,8],[51,2,52,8],[9,2,10,2],[9,3,9,5],[9,6,10,6],[10,3,10,5],[30,2,31,8],[40,2,40,3],[41,2,41,3],[21,2,22,8],[37,1,38,8],[23,2,24,8],[25,2,26,8]]}
[null,"From: Delisle and Woodard (1988) based on Van Wagner (1982)"]
[null,"Also used info in Ember Research Services Ltd (1997)"]
[]
[null,"To calculate the weight of various size classes of downed-dead roundwood fuels <= 7.0 cm in diameter"]
[]
[]
[null,"W = ","kn(QMD)2Gac"]
[null,null,"NL"]
[]
[null,"(QMD)2 =","(","(b1+1) * (x2b1+3 - X1b1+3 )",null,null,")0.5"]
[null,null,null,"(b1+3) * (x2b1+1 - X1b1+1 )"]
[]
[null,"Y=","axb"]
[]
[]
[null,"c=","(1+((% ground slope)/100)2))0.5"]
[]
[]
[null,"W","fuel load (t/ha)"]
[null,"k","1.234 (constant to convert roundwood volume to a weight per unit area basis"]
[null,"n","number of intercepts per roundwood diameter size class"]
[null,"(QMD)2","squared quadratic mean diameter for intercepted roundwood <= 7.0 cm in diameter (cm2)"]
[]
[null,"G","specific gravity of roundwood according to diameter size class and/or degree of decay"]
[]
[null,"a","correction factor for nonhorizontal angle of roundwood pieces (1.13 for roundwood <= 7 cm in diameter (Brown and Roussopoulos 1974))"]
[]
[null,"c","slope correction factor"]
[null,"N","number of fuel sampling transects"]
[null,"L","length of the fuel transect (m)"]
[null,"y","number of intersections per unit length of sample line for a diameter class of one unit width"]
[]
[null,"x2","upper size class limit of class i"]
[null,"x1","lower size class limit of class i"]
[null,"b ","constant"]
[null,"a","constant"]
[]
[null,"To calculate the weight of roundwood pieces > 7.0 cm in diameter"]
[]
[]
{"$rows_left_out":17}
{"sheet":"Specific Gravity","index":7,"n_rows":76,"n_cols":12,"rows_kept":76,"cut":false,"hidden":true,"merged":[[75,0,103,8]]}
[]
[null,"Nominal relative densities* by species and size class",null,null,null,null,null,null,null,null,"Nominal relative densities* by species and size class"]
[null,null,null,"Size Class (cm)"]
[]
[null,"Code","Species","0-0.5","0.5-1","1-3","3-5","5-7","7+",null,"Code","Order"]
[null,null,"Class ID",1,2,3,4,5,6]
[null,"Cw","western redcedar",0.48,0.48,0.33,0.33,0.33,0.33,null,"Cw",1]
[null,"Yc","yellow-cedar",0.44,0.44,0.42,0.42,0.42,0.42,null,"Yc",2]
[null,"Fd","Douglas-fir",0.55000000000000004,0.55000000000000004,0.43,0.43,0.43,0.43,null,"Fd",3]
[null,"Fdc","coastal Douglas-fir",0.53,0.53,0.43,0.43,0.43,0.43,null,"Fdc",4]
[null,"Fdi","interior Douglas-fir",0.56999999999999995,0.56999999999999995,0.43,0.43,0.4,0.4,null,"Fdi",5]
[null,"Ba","amabilis fir",0.43,0.43,0.4,0.4,0.4,0.4,null,"Ba",6]
[null,"Bg","grand fir",0.57999999999999996,0.57999999999999996,0.5,0.45,0.45,0.45,null,"Bg",7]
[null,"Bp","noble fir",0.39,0.39,0.36,0.36,0.36,0.36,null,"Bp",8]
[null,"Bl","subalpine fir",0.41,0.41,0.4,0.4,0.4,0.4,null,"Bl",9]
[null,"Hm","mountain hemlock",0.45,0.45,0.43,0.43,0.43,0.43,null,"Hm",10]
[null,"Hw","western hemlock",0.45,0.45,0.43,0.43,0.43,0.43,null,"Hw",11]
[null,"Hxm","mountain x western hemlock hybrid",0.45,0.45,0.43,0.43,0.43,0.43,null,"Hxm",12]
[null,"Jr","Rocky Mtn. juniper",0.44,0.44,0.42,0.42,0.42,0.42,null,"Jr",13]
[null,"La","alpine larch",0.54,0.54,0.55000000000000004,0.55000000000000004,0.55000000000000004,0.55000000000000004,null,"La",14]
[null,"Lt","tamarack",0.53,0.53,0.51,0.51,0.51,0.51,null,"Lt",15]
[null,"Lw","western larch",0.5,0.5,0.55000000000000004,0.55000000000000004,0.55000000000000004,0.55000000000000004,null,"Lw",16]
[null,"Pj","jack pine",0.43,0.43,0.4,0.4,0.4,0.4,null,"Pj",17]
[null,"Pf","limber pine",0.38,0.38,0.34,0.34,0.34,0.34,null,"Pf",18]
[null,"Pl","lodgepole pine",0.49,0.49,0.41,0.41,0.41,0.41,null,"Pl",19]
[null,"Pxj","lodgepole x jack pine hybrid",0.46,0.46,0.4,0.4,0.4,0.4,null,"Pxj",20]
[null,"Py","ponderosa pine",0.41,0.41,0.51,0.51,0.51,0.51,null,"Py",21]
[null,"Plc","shore pine",0.49,0.49,0.41,0.41,0.41,0.41,null,"Plc",22]
[null,"Pw","western white pine",0.38,0.38,0.34,0.34,0.34,0.34,null,"Pw",23]
[null,"Pa","whitebark pine",0.38,0.38,0.34,0.34,0.34,0.34,null,"Pa",24]
[null,"Sb","black spruce",0.4,0.4,0.38,0.38,0.38,0.38,null,"Sb",25]
[null,"Se","Engelmann spruce",0.34,0.34,0.34,0.34,0.34,0.34,null,"Se",26]
[null,"Ss","Sitka spruce",0.4,0.4,0.38,0.38,0.38,0.38,null,"Ss",27]
[null,"Sw","white spruce",0.4,0.4,0.38,0.38,0.38,0.38,null,"Sw",28]
[null,"Sx","spruce hybrid",0.38,0.38,0.36,0.36,0.36,0.36,null,"Sx",29]
[null,"Tw","western yew",0.5,0.5,0.55000000000000004,0.55000000000000004,0.55000000000000004,0.55000000000000004,null,"Tw",30]
[null,"Dm","mountain alder",0.41,0.41,0.41,0.41,0.41,0.4,null,"Dm",31]
[null,"Dr","red alder",0.41,0.41,0.41,0.41,0.41,0.4,null,"Dr",32]
[null,"Dg","green and Sitka alder",0.41,0.41,0.41,0.41,0.41,0.4,null,"Dg",33]
[null,"Up","Pacific crab apple",0.5,0.5,0.46,0.46,0.46,0.46,null,"Up",34]
{"$rows_left_out":36}