{"text_format":"1","workbook":"xlsx","n_sheets":5,"sheets":["Invoice","Pandemic Pay Claim","List of eligible roles","Validation Lists ","Funding Org's "],"not_rendered":{"charts":0,"images":0,"macros":1,"external_links":10,"defined_names":36,"comments":0,"pivot_tables":0},"unopened":[],"bounds":{"document_bytes":16777216,"sheet_cells":100000,"rows_first":2000,"rows_last":500,"rows_between":2000,"halvings":0,"cell_chars":16384,"cell_head_chars":4096},"cells_cut":0,"cells_raw":0,"read":"whole","date_system":"1900"}

{"sheet":"Invoice","index":0,"n_rows":45,"n_cols":12,"rows_kept":45,"cut":false,"hidden":false,"merged":[[39,2,39,4],[43,2,43,4],[22,0,22,1],[23,0,23,1],[25,0,25,3],[26,0,26,3],[27,0,27,3],[31,0,31,4],[34,0,34,4],[35,0,35,4],[36,0,36,4],[33,0,33,4],[16,0,16,3],[0,1,0,4],[5,0,5,1],[8,0,11,0],[8,1,11,3],[15,0,15,3]]}
["Enter Organisation Legal Name ","XYZ Agency Invoice "]
["Street Address"]
["City,Province Postal Code"]
[]
["Vendor Number if Known"]
[]
[]
["To:",null,null,null,"Date:"]
["Ministry of Finance - Province of BC"]
[]
[null,null,null,null,"Invoice #:"]
[null,null,null,null,"Your Invoice Number"]
[]
[]
[]
["DESCRIPTION ",null,null,null,"AMOUNT"]
[]
["Pandemic Pay Claim, calculated as per the attachment",null,null,null,{"$f":"+SUM('Pandemic Pay Claim'!F23:F53)","v":0}]
[]
["Less any previously paid monies used for temporary wage enhancements (i.e. BC Housing -Safe Staffing )",null,null,null,{"$f":"0","v":0}]
[]
[null,null,null,null,null,null,null,null,null,null,null,{"$f":"IF('Funding Org''s '!B16=\"TRUE\",1000,0)","v":0}]
[]
[]
["GST (Check if applicable)",null,null,null,{"$f":"IF('Funding Org''s '!B16=TRUE,E18*0.05,0)","v":0}]
[]
["GST Registration # ######### RT0001"]
[]
[null,null,null,"TOTAL",{"$f":"+E25+E18-E20","v":0}]
["NOTE: Please ensure that only hours worked during the 16 week eligibility period are claimed."]
["Please email this worksheet to :  bcpandemicpayclaim@sp2016.sp.gov.bc.ca"]
[]
["Certification:"]
["I certify that I am authorized by (Legal Name of Organisation) to provide the information attached in this invoice and that the information is true, complete and correct."]
["I further certify that I am authorized by(Legal Name of Organisation) to provide the understandings and acknowledgements provided herein. "]
["I understand and acknowledge that the information provided in this invoice and in the supporting documentation is being disclosed by us and being collected by Her Majesty the Queen in Right of the Province British Columbia (the “Province”) in order to authorize and certify payment to certain individuals entitled to received a supplement to their pay on account of the provincial Covid 19 health emergency, as described in our correspondence dated xxxx/2020 to your organization."]
["I further understand that (Legal Name of Organisation) will retain any and all records supporting this invoice, and that all of those records are subject to audit by the Province at any time, and that if any discrepancies arise, the organization will be required to return any funds it was not eligible to receive, or did not use or disburse appropriately, to the Province, at the time of the Province’s request that it do so.”"]
[]
[]
[]
["Name (Print)",null,null,"Position within organization"]
[]
[]
[]
["Authorized Signature",null,null,"Date (YYYY/MM/DD)"]

{"sheet":"Pandemic Pay Claim","index":1,"n_rows":54,"n_cols":6,"rows_kept":54,"cut":false,"hidden":false,"merged":[[2,0,2,1],[15,0,15,1],[0,0,0,5],[16,0,16,1],[15,4,15,5],[16,4,16,5],[2,5,3,5]]}
["Pandemic Pay Claim"]
[]
["Vendor Name (Legal Name):",null,null,null,"Total Organisation Funding "]
["Vendor Number (If Known)",null,null,null,"(Must include non-provincial funding)"]
["Date YYYY-MM-DD:"]
[]
["Check all funding/contracting organisations that apply"]
["Public Safety and Solictor General",null,null,"Fraser Health Authority","Ministry of Education"]
["Ministry of Health",null,null,"Interior Health Authority","Ministry of Mental Health and Addictions"]
["Ministry of Finance",null,null,"Northern Health Authority"]
["Ministry of Jobs, Economic Development, Competitiveness",null,null,"Vancouver Coastal Health Authority"]
["Community Living BC",null,null,"Island Health Authority"]
["Ministry of Children and Family Development",null,null,"BC Housing Management Commission"]
["Ministry of Social Development and Poverty Reduction",null,null,"Provincial Health Authority Services"]
[]
["Vendor ID Number\nFor Office Use Only",null,null,null,"Claim ID Number\nFor Office Use Only"]
[]
[]
[null,null,null,null,"Claim Amount",{"$f":"tblClaimData[[#Totals],[Amount claimed\n $4 per hour,\n($)]]","v":0}]
[null,null,null,null,"GST Amount",{"$f":"0.05 *F19","v":0}]
["NOTE: Please ensure that only hours worked during the 16 week eligibility period are claimed.",null,null,null,"Total Invoice Amount",{"$f":"F19+F20","v":0}]
["Line #","Number of affected Employees","Role","Programs (separated by forward slashes)","Total straight time hours worked","Amount claimed\n $4 per hour,\n($)"]
[1,null,null,null,null,{"$f":"+E23*4","v":0}]
[2,null,null,null,null,{"$f":"+E24*4","v":0}]
[3,null,null,null,null,0]
[4,null,null,null,null,0]
[5,null,null,null,null,0]
[6,null,null,null,null,0]
[7,null,null,null,null,0]
[8,null,null,null,null,0]
[9,null,null,null,null,0]
[10,null,null,null,null,0]
[11,null,null,null,null,0]
[12,null,null,null,null,0]
[13,null,null,null,null,0]
[14,null,null,null,null,0]
[15,null,null,null,null,0]
[16,null,null,null,null,0]
[17,null,null,null,null,0]
[18,null,null,null,null,0]
[19,null,null,null,null,0]
[20,null,null,null,null,0]
[21,null,null,null,null,0]
[22,null,null,null,null,0]
[23,null,null,null,null,0]
[24,null,null,null,null,0]
[25,null,null,null,null,0]
[26,null,null,null,null,0]
[27,null,null,null,null,0]
[28,null,null,null,null,0]
[29,null,null,null,null,0]
[30,null,null,null,null,0]
[31,null,null,null,null,0]
["Total",null,null,null,null,{"$f":"SUBTOTAL(109,tblClaimData[Amount claimed\n $4 per hour,\n($)])","v":0}]

{"sheet":"List of eligible roles","index":2,"n_rows":82,"n_cols":2,"rows_kept":82,"cut":false,"hidden":true,"merged":[]}
["Classification","Included"]
["Aboriginal Delegated Social Worker","Yes"]
["Accountant","Yes"]
["Accounting Clerk","Yes"]
["Activity Worker","Yes"]
["Addictions Counsellor","Yes"]
["Administrative Assistant 1","Yes"]
["Administrative Assistant 2","Yes"]
["Administrative Assistant 3","Yes"]
["Administrative Assistant 4","Yes"]
["Adult, Youth and/or Child Counsellor","Yes"]
["Adult, Youth and/or Child Worker","Yes"]
["Asleep Residential Night Worker","Yes"]
["Awake Residential Night Worker","Yes"]
["Behaviour Consultant","Yes"]
["Bookkeeper","Yes"]
["Building Maintenance Worker","Yes"]
["Child & Youth Transition House Worker","Yes"]
["Children Who Witness Abuse Counsellor","Yes"]
["Children Who Witness Abuse Counsellor - Art\nSpecialist","Yes"]
["Clinical Counsellor","Yes"]
["Community Connector","Yes"]
["Community Support Worker","Yes"]
["Computer Technical Support Specialist","Yes"]
["Cook","Yes"]
["Emergency Shelter Worker","Yes"]
["Family Counsellor","Yes"]
["Family Support Worker","Yes"]
["Group Facilitator","Yes"]
["Housekeeper","Yes"]
["Infant Development Consultant","Yes"]
["Janitor","Yes"]
["Licensed Practical Nurse","Yes"]
["Nurse","Yes"]
["Nutritionist","Yes"]
["Occupational Therapist","Yes"]
["Passenger Vehicle Driver","Yes"]
["Physiotherapist","Yes"]
["Program Coordinator 1","Yes"]
["Program Coordinator 2","Yes"]
["Reconnect Worker","Yes"]
["Residence Coordinator","Yes"]
["Residence Worker","Yes"]
["Residence Worker Senior","Yes"]
["Residential Child & Youth Worker","Yes"]
["Special Services Worker","Yes"]
["Stopping the Violence Counsellor","Yes"]
["Supervised Access Worker","Yes"]
["Transition House Worker","Yes"]
["Victim Service Worker","Yes"]
["Clinical Pharmacist/Clinical Specialist Pharmacist","Yes"]
["Dental Assistant/Dental Hygienist","Yes"]
["Detox Worker","Yes"]
["Pharmacy Assistant","Yes"]
["Pharmacy Technician","Yes"]
["Retail Supervisor","Yes"]
["Retail Worker","Yes"]
["School Based Prevention Worker","Yes"]
["Settlement & Integration Worker","Yes"]
["Speech Language Pathologist","Yes"]
{"$rows_left_out":23}
{"sheet":"Validation Lists ","index":3,"n_rows":89,"n_cols":14,"rows_kept":89,"cut":false,"hidden":true,"merged":[]}
["Sub_Sector","Service Stream","Workplace Type",null,"Workplace",null,"Sub_Sector","Employer Type","Role","Combined Role",null,"EligibleRole",null,"Combined Role"]
["Health Services","Health System","Hospitals",null,"BC Housing-BC Housing main location and other offices",null,"Health Services","Health System","Registered nurses","Registered Nurse",null,"BC Housing -Pest control and building management workers",null,"Registered Nurse"]
["Health Services","Health System","Long term care and assisted living facilities",null,"Community Living BC-Local offices",null,"Health Services","Health System","Licensed practical nurses","Registered Nurse",null,"BC Housing-Maintenance and janitorial workers",null,"Other Health Professionals"]
["Health Services","Health System","Provincial mental health facilities",null,"Community Living BC-Provincial assessment centre",null,"Health Services","Health System","Registered psychiatric nurses","Registered Nurse",null,"BC Housing-Registered nurse",null,"Operational Support"]
["Health Services","Health System","Provincially funded home and community care services",null,"Community living-Intervenor residential sites",null,"Health Services","Health System","Allied health professionals","Other Health Professionals",null,"BC Housing-Tenant support workers",null,"Social Sector Direct"]
["Health Services","Health System","Public health units",null,"Community living-Residential services",null,"Health Services","Health System","Resident doctors","Other Health Professionals",null,"Community Living BC-Dietary aide",null,"Other"]
["Health Services","Health System","Primary care clinics",null,"Correctional System-Adult correctional facilities and youth justice facilities",null,"Health Services","Health System","Health care assistants, community health workers and other patient care support workers","Other Health Professionals",null,"Community Living BC-Mental health support worker",null,"Correctional System Direct"]
["Health Services","Health System","Diagnostic facilities",null,"Correctional System-Community corrections offices",null,"Health Services","Health System","Paramedics","Other Health Professionals",null,"Community Living BC-Occupational therapist"]
["Health Services","Health System","Community clinics",null,"Correctional System-Sheriff services division (Deputy Sheriffs only)",null,"Health Services","Health System","Pharmacists","Other Health Professionals",null,"Community Living BC-Registered nurse"]
["Health Services","Health System","Diagnostic and treatment centres",null,"Harm reduction-Adult justice residential facilities",null,"Health Services","Health System","Administrative/clerical support roles","Operational Support",null,"Correctional System-Aboriginal liaison officers"]
["Social Services","Community living","Residential services",null,"Harm reduction-Directly operated residential facilities",null,"Health Services","Health System","Food service workers","Operational Support",null,"Correctional System-Administration staff"]
["Social Services","Community living","Intervenor residential sites",null,"Harm reduction-Emergency outreach harm reduction workers",null,"Health Services","Health System","Housekeepers","Operational Support",null,"Correctional System-Case management supervisors"]
["Social Services","Indigenous services","Delegated aboriginal agencies",null,"Harm reduction-Emergency shelters",null,"Health Services","Health System","Laundry workers","Operational Support",null,"Correctional System-Chaplains"]
["Social Services","Indigenous services","Friendship centres providing critical services",null,"Harm reduction-Hotels or motels used for self-isolation and/or shelter overflow",null,"Health Services","Health System","Porters","Operational Support",null,"Correctional System-Chef manager (bargaining unit)"]
["Social Services","Indigenous services","Healing and wellness facilities and shelters",null,"Harm reduction-Respite/drop-in centres",null,"Health Services","Health System","Security","Operational Support",null,"Correctional System-Cooks"]
["Social Services","Harm reduction","Shelters for survivors of gender-based violence and human trafficking",null,"Harm reduction-Safe Injection sites",null,"Social Services","Social services","Community support workers","Social Sector Direct",null,"Correctional System-Correctional instructors"]
["Social Services","Harm reduction","Directly operated residential facilities",null,"Harm reduction-Shelters for survivors of gender-based violence and human trafficking",null,"Social Services","Social services","Employment support workers","Social Sector Direct",null,"Correctional System-Correctional officers"]
["Social Services","Harm reduction","Adult justice residential facilities",null,"Harm reduction-Supportive housing facilities",null,"Social Services","Social services","Residence workers","Social Sector Direct",null,"Correctional System-Correctional supervisors"]
["Social Services","Harm reduction","Safe Injection sites",null,"Harm reduction-Temporary shelter facilities",null,"Social Services","Social services","Adult/youth workers","Social Sector Direct",null,"Correctional System-Deputy sheriffs"]
["Social Services","Harm reduction","Emergency outreach harm reduction workers",null,"Health System-Community clinics",null,"Social Services","Social services","Transition house workers","Social Sector Direct",null,"Correctional System-Finance and administrative clerks"]
["Social Services","Harm reduction","Emergency shelters",null,"Health System-Diagnostic and treatment centres",null,"Social Services","Social services","Stopping the violence counsellors","Social Sector Direct",null,"Correctional System-General helpers"]
["Social Services","Harm reduction","Supportive housing facilities",null,"Health System-Diagnostic facilities",null,"Social Services","Social services","Victim service workers","Social Sector Direct",null,"Correctional System-Health care workers"]
["Social Services","Harm reduction","Respite/drop-in centres",null,"Health System-Hospitals",null,"Social Services","Social services","Emergency shelter workers","Social Sector Direct",null,"Correctional System-Local manager (bargaining unit)"]
["Social Services","Harm reduction","Temporary shelter facilities",null,"Health System-Long term care and assisted living facilities",null,"Social Services","Social services","Program coordinators","Social Sector Direct",null,"Correctional System-Office assistants"]
["Social Services","Harm reduction","Hotels or motels used for self-isolation and/or shelter overflow",null,"Health System-Primary care clinics",null,"Social Services","Social services","Counsellors","Other Health Professionals",null,"Correctional System-Office manager (bargaining unit)"]
["Social Services","Youth services","High risk youth services",null,"Health System-Provincial mental health facilities",null,"Social Services","Social services","Occupational and physical therapists","Social Sector Direct",null,"Correctional System-Probation officers"]
["Social Services","Youth services","Youth justice residential facilities",null,"Health System-Provincially funded home and community care services",null,"Social Services","Social services","Behavioural therapists","Social Sector Direct",null,"Correctional System-Psychologists"]
["Social Services","Youth services","Licenced children's residential sites",null,"Health System-Public health units",null,"Social Services","Social services","Family preservation workers","Social Sector Direct",null,"Correctional System-Senior probation officers"]
["Social Services","Immigrant services","High risk support services for immigrants and refugees",null,"Immigrant services-High risk immigrant youth services",null,"Social Services","Social services","Domestic violence workers","Social Sector Direct",null,"Correctional System-Social workers"]
["Social Services","Immigrant services","High risk immigrant youth services",null,"Immigrant services-High risk support services for immigrants and refugees",null,"Social Services","Social services","Social workers","Social Sector Direct",null,"Correctional System-Youth custody nurses"]
["Social Services","Immigrant services","Settlement services",null,"Immigrant services-Settlement services",null,"Social Services","Social services","Child and youth mental health workers","Other Health Professionals",null,"Correctional System-Youth supervisors"]
["Social Services","SDPR","SDPR Income Assistance and Disability Assistance Offices",null,"Indigenous services-Delegated aboriginal agencies",null,"Social Services","Social services","Indigenous service workers","Social Sector Direct",null,"Health System-Administrative/clerical support roles"]
["Social Services","SDPR","SDPR/Service BC Integrated Offices",null,"Indigenous services-Friendship centres providing critical services",null,"Social Services","Social services","Administrative and client support roles","Operational Support",null,"Health System-Allied health professionals"]
["Social Services","SDPR","SDPR Contact Center Offices",null,"Indigenous services-Healing and wellness facilities and shelters",null,"Social Services","Social services","Maintenance workers","Operational Support",null,"Health System-Essential non-clinical staff, including"]
["Social Services","Service BC","Service BC offices",null,"MCFD-Service Delivery Division",null,"Social Services","Social services","Housekeepers","Operational Support",null,"Health System-Food service workers"]
["Social Services","Service BC","Victoria Corporate Registries Branch",null,"SDPR-SDPR Contact Center Offices",null,"Social Services","Social services","Janitors","Operational Support",null,"Health System-Health care assistants, community health workers and other patient care support workers"]
["Social Services","MCFD","Service Delivery Division",null,"SDPR-SDPR Income Assistance and Disability Assistance Offices",null,"Social Services","Social services","Food service workers","Operational Support",null,"Health System-Housekeepers"]
["Social Services","BC Housing","BC Housing main location and other offices",null,"SDPR-SDPR/Service BC Integrated Offices",null,"Social Services","Social services","Passenger vehicle drivers","Operational Support",null,"Health System-Laundry workers"]
["Social Services","Community Living BC","Local offices",null,"Service BC-Service BC offices",null,"Social Services","Social services","Other key roles.","Other",null,"Health System-Licensed practical nurses"]
["Social Services","Community Living BC","Provincial assessment centre",null,"Service BC-Victoria Corporate Registries Branch",null,"Social Services","SDPR","Employment and assistance workers","Social Sector Direct",null,"Health System-Other key roles"]
["Corrections","Correctional System","Adult correctional facilities and youth justice facilities",null,"Youth services-High risk youth services",null,"Social Services","SDPR","Client services workers","Social Sector Direct",null,"Health System-Paramedics"]
["Corrections","Correctional System","Community corrections offices",null,"Youth services-Licenced children's residential sites",null,"Social Services","SDPR","Community integration specialists","Social Sector Direct",null,"Health System-Pharmacists"]
["Corrections","Correctional System","Sheriff services division (Deputy Sheriffs only)",null,"Youth services-Youth justice residential facilities",null,"Social Services","SDPR","Service delivery division supervisors","Social Sector Direct",null,"Health System-Porters"]
[null,null,null,null,null,null,"Social Services","SDPR","Service delivery division assistant supervisors","Social Sector Direct",null,"Health System-Registered nurses"]
[null,null,null,null,null,null,"Social Services","SDPR","Service delivery division supervisors of administrative services","Social Sector Direct",null,"Health System-Registered psychiatric nurses"]
[null,null,null,null,null,null,"Social Services","Service BC","Customer service representatives","Social Sector Direct",null,"Health System-Resident doctors"]
[null,null,null,null,null,null,"Social Services","Service BC","Registries support clerk","Operational Support",null,"Health System-Security"]
[null,null,null,null,null,null,"Social Services","Service BC","Administrative assistants","Operational Support",null,"MCFD-Adoptions workers"]
[null,null,null,null,null,null,"Social Services","Service BC","Manager of administration","Operational Support",null,"MCFD-Child and Family Services workers"]
[null,null,null,null,null,null,"Social Services","MCFD","Child protection workers","Social Sector Direct",null,"MCFD-Child protection workers"]
[null,null,null,null,null,null,"Social Services","MCFD","Resource workers","Social Sector Direct",null,"MCFD-Community youth justice workers"]
[null,null,null,null,null,null,"Social Services","MCFD","Child and Family Services workers","Social Sector Direct",null,"MCFD-Mental health workers"]
[null,null,null,null,null,null,"Social Services","MCFD","Adoptions workers","Social Sector Direct",null,"MCFD-Resource workers"]
[null,null,null,null,null,null,"Social Services","MCFD","Mental health workers","Social Sector Direct",null,"MCFD-Special needs workers"]
[null,null,null,null,null,null,"Social Services","MCFD","Special needs workers","Social Sector Direct",null,"SDPR-Client services workers"]
[null,null,null,null,null,null,"Social Services","MCFD","Community youth justice workers","Social Sector Direct",null,"SDPR-Community integration specialists"]
[null,null,null,null,null,null,"Social Services","BC Housing","Tenant support workers","Social Sector Direct",null,"SDPR-Employment and assistance workers"]
[null,null,null,null,null,null,"Social Services","BC Housing","Maintenance and janitorial workers","Operational Support",null,"SDPR-Service delivery division assistant supervisors"]
[null,null,null,null,null,null,"Social Services","BC Housing ","Pest control and building management workers","Social Sector Direct",null,"SDPR-Service delivery division supervisors"]
[null,null,null,null,null,null,"Social Services","BC Housing","Registered nurse","Registered Nurse",null,"SDPR-Service delivery division supervisors of administrative services"]
{"$rows_left_out":30}
{"sheet":"Funding Org's ","index":4,"n_rows":18,"n_cols":2,"rows_kept":18,"cut":false,"hidden":false,"merged":[]}
["Organisation","Funding"]
["Public Safety and Solictor General",false]
["Ministry of Health",false]
["Ministry of Finance",false]
["Ministry of Jobs ",false]
["Community Living BC",false]
["BC Housing Organisation",false]
["Fraser Health Authority",false]
["Interior Helath Authority",false]
["Northern Health Authority",false]
["Vancouver Coastal Health Authority",false]
["Island Health Authority",false]
["Ministry of Social Development and Poverty Reduction",false]
["Ministry of Children and Family Development",false]
["Provinical Health Services Authority",false]
["Include GST",true]
["Ministy of Education",false]
["Ministry of Mental Health and Addictions",false]