{"text_format":"1","workbook":"xlsx","n_sheets":12,"sheets":["Introduction","Data Input and Instructions","Summary of results","PrintSheet","Comparative","One Street Light Example","Unit Pricing BAU","unit pricing 1-5 years scenario","ballast losses","GHG Calculator","GHG savings","Assumptions"],"not_rendered":{"charts":1,"images":5,"macros":1,"external_links":0,"defined_names":1,"comments":1,"pivot_tables":0},"unopened":[],"bounds":{"document_bytes":16777216,"sheet_cells":100000,"rows_first":2000,"rows_last":500,"rows_between":2000,"halvings":0,"cell_chars":16384,"cell_head_chars":4096},"cells_cut":0,"cells_raw":0,"read":"whole","date_system":"1900"}

{"sheet":"Introduction","index":0,"n_rows":15,"n_cols":2,"rows_kept":15,"cut":false,"hidden":false,"merged":[]}
[]
[null,"LED Streetlights Across BC Project Evaluation Tool"]
[null,"Disclaimer:"]
[]
[null,"• The Government of British Columbia (\"The Province\") makes no representation or warranty with respect to the accuracy or completeness of any estimates generated by the Estimator. The Province accepts no liability of any kind arising out of a user’s use of or reliance of the Estimator."]
[]
[null,"• The estimates are intended for illustrative purposes only. They are based on values entered by the user and should not be considered an exact forecast of incentives."]
[]
[null,"• The Estimator is intended for municipal organizations with street lighting to estimate the financial benefits of LED and controls with street lighting. This Estimator is to provide estimates of financial and energy savings as a starting point, but these estimates can vary widely, and customers are responsible for verifying their actual energy savings. "]
[]
{"$rows_left_out":6}
{"sheet":"Data Input and Instructions","index":1,"n_rows":72,"n_cols":27,"rows_kept":72,"cut":false,"hidden":true,"merged":[[69,1,69,3],[2,2,2,3],[36,1,36,3],[57,1,57,3],[22,1,22,3],[3,2,3,3],[9,1,9,3],[61,1,61,3],[64,1,64,3],[48,1,48,3],[5,2,5,3],[7,2,7,3],[23,2,23,3],[1,1,1,3],[37,1,37,3],[4,2,4,3],[6,2,6,3],[35,1,35,3],[10,2,10,3],[24,3,33,3]]}
[null,null,null,null,null,{"$f":"\"LED Street Lights Project Evaluation for \"&C3","v":"LED Street Lights Project Evaluation for "}]
[null,"Step 1: General Information",null,null,null,null,null,null,null,null,null,null,null,null,null,null,null,null,null,null,null,null,"PROJ_TYPES","RATES",null,"YES_NO","PROJ_YEARS"]
[null,"Name of Jurisdiction",null,null,null,null,null,null,null,null,null,null,null,null,null,null,null,null,null,null,null,null,"LED retrofit only",1702,null,"YES",1]
[null,"Contact Name",null,null,null,null,null,null,null,null,null,null,null,null,null,null,null,null,null,null,null,null,"LED retrofit with adaptive controls",1703,null,"NO",2]
[null,"Contact Title",null,null,null,null,null,null,null,null,null,null,null,null,null,null,null,null,null,null,null,null,"Adaptive controls only",null,null,null,3]
[null,"Contact Telephone #",null,null,null,null,null,null,null,null,null,null,null,null,null,null,null,null,null,null,null,null,null,null,null,null,4]
[null,"Contact Email",null,null,null,null,null,null,null,null,null,null,null,null,null,null,null,null,null,null,null,null,null,null,null,null,5]
[null,"Date"]
[]
[null,"Step 2: Inventory"]
{"$rows_left_out":63}
{"sheet":"Summary of results","index":2,"n_rows":33,"n_cols":9,"rows_kept":33,"cut":false,"hidden":true,"merged":[[32,1,32,4],[24,1,24,4],[27,1,27,4],[30,1,30,4],[18,1,18,4],[23,1,23,5],[29,1,29,5],[31,1,31,4],[26,1,26,4],[25,1,25,4],[21,1,21,4],[20,1,20,4],[19,1,19,4],[4,4,4,5],[1,4,1,5],[5,4,8,4],[5,5,8,5],[17,1,17,4],[16,1,16,5],[13,1,13,3],[12,1,12,3],[9,1,9,3],[10,1,10,3],[11,1,11,3],[14,1,14,3]]}
[]
[null,"Key Values (15-year evaluation):",null,null,"Summary of Results (15-year evaluation)"]
[null,"Total Energy Savings (kWh)",{"$f":"F18","v":0},null,null,{"$f":"\"LED Street Lights Project Evaluation for \"&'Data Input and Instructions'!C3","v":"LED Street Lights Project Evaluation for "}]
[null,"Total $ Savings",{"$f":"F31","v":0},null,null,{"$f":"+'Data Input and Instructions'!C8","v":"00:00:00"}]
[null,"Post-Incentive ROI",{"$f":"F32","v":{"$error":"#DIV/0!"}},null,"Part 1: Costs"]
[null,"Post-Incentive Payback",{"$f":"F33","v":1},null,"Business As Usual (BAU) HPS or other type of luminaries",{"$f":"CHOOSE('Data Input and Instructions'!$E$24,G7,H7,I7,\"N/A\")&\" (Post-Incentive)\"","v":"LED without adaptive controls (Post-Incentive)"}]
[null,"Pre-Incentive ROI",{"$f":"F21","v":{"$error":"#DIV/0!"}},null,null,null,"LED without adaptive controls","LED with adaptive controls","Adaptive controls only (No LED)"]
[null,"Pre-Incentive Payback",{"$f":"F22","v":1}]
[]
[null,"Total Cost ($ Nominal)",null,null,{"$f":"+SUM(Comparative!D9:D12)","v":0},{"$f":"CHOOSE('Data Input and Instructions'!$E$24,G10,H10,I10,\"N/A\")","v":0},{"$f":"Comparative!D26+Comparative!D29+Comparative!D30+Comparative!D31+Comparative!D32-Comparative!D27-Comparative!D28","v":0},{"$f":"Comparative!D58+Comparative!D61+Comparative!D62+Comparative!D63+Comparative!D64-Comparative!D59-Comparative!D60","v":0},{"$f":"Comparative!D90+Comparative!D93+Comparative!D94+Comparative!D95+Comparative!D96-Comparative!D91-Comparative!D92","v":0}]
{"$rows_left_out":24}
{"sheet":"PrintSheet","index":3,"n_rows":25,"n_cols":8,"rows_kept":25,"cut":false,"hidden":true,"merged":[[24,2,24,3],[23,1,23,3],[9,5,9,6],[10,5,10,6],[11,5,11,6],[8,5,8,6],[6,1,6,3],[6,5,6,7],[1,1,1,7],[2,1,2,7],[7,5,7,6]]}
[]
[null,"LED Streetlight Project Evaluation:"]
[null,{"$f":"'Data Input and Instructions'!C24","v":"LED retrofit only"}]
[]
[null,{"$f":"'Data Input and Instructions'!C3","v":0},null,null,null,null,null,{"$f":"'Data Input and Instructions'!C8","v":"00:00:00"}]
[]
[null,"Project Summary",null,null,null,"Financial Summary"]
[]
[null,{"$f":"'Data Input and Instructions'!C25&\"-year implementation\"","v":"1-year implementation"},null,null,null,"Total Energy Savings (kWh)",null,{"$f":"'Summary of results'!C3","v":0}]
[null,{"$f":"\"BC Hydro rate \"&'Data Input and Instructions'!C11","v":"BC Hydro rate 1702"},null,null,null,"Total $ Savings",null,{"$f":"'Summary of results'!C4","v":0}]
{"$rows_left_out":16}
{"sheet":"Comparative","index":4,"n_rows":146,"n_cols":27,"rows_kept":146,"cut":false,"hidden":true,"merged":[[122,3,122,4]]}
[null,null,null,null,null,"LED Street Lights Project Evaluation for",null,null,null,{"$f":"+'Data Input and Instructions'!C3","v":0}]
[null,"Discount Rate",{"$f":"'Data Input and Instructions'!C69","v":0.02}]
[]
[null,null,null,null,null,"Year"]
[null,null,null,null,0,1,2,3,4,5,6,7,8,9,10,11,12,13,14,15,16,17,18,19,20,16]
[null,null,"Discount Factor",null,{"$f":"-PV($C$2,E5,0,1,0)","v":1},0.98039215686274506,0.96116878123798544,0.94232233454704462,0.9238454260265142,0.90573080982991594,0.88797138218619198,0.87056017861391388,0.85349037119011162,0.83675526587265847,0.82034829987515534,0.80426303909328967,0.78849317558165644,0.77303252508005538,0.75787502458828948,{"$f":"-PV($C$2,T5,0,1,0)","v":0.74301472998851925},{"$f":"-PV($C$2,U5,0,1,0)","v":0.72844581371423445},0.7141625624649357,0.7001593749656233,0.68643075977021895,0.67297133310805779,0.72844581371423445]
["Business as Usual Scenario with High Pressure Sodium Lamps (HPS)"]
[]
[null,"Nominal Value","Capital Cost (replacements)",{"$f":"SUM(F9:T9)","v":0},{"$f":"SUM('Unit Pricing BAU'!H45:H51)","v":0},{"$f":"SUM('Unit Pricing BAU'!J44:J51)+SUM('Unit Pricing BAU'!J4:J11)","v":0},{"$f":"SUM('Unit Pricing BAU'!K44:K51)+SUM('Unit Pricing BAU'!K4:K11)","v":0},{"$f":"SUM('Unit Pricing BAU'!L44:L51)+SUM('Unit Pricing BAU'!L4:L11)","v":0},{"$f":"SUM('Unit Pricing BAU'!M44:M51)+SUM('Unit Pricing BAU'!M4:M11)","v":0},{"$f":"SUM('Unit Pricing BAU'!N44:N51)+SUM('Unit Pricing BAU'!N4:N11)","v":0},{"$f":"SUM('Unit Pricing BAU'!O44:O51)+SUM('Unit Pricing BAU'!O4:O11)","v":0},{"$f":"SUM('Unit Pricing BAU'!P44:P51)+SUM('Unit Pricing BAU'!P4:P11)","v":0},{"$f":"SUM('Unit Pricing BAU'!Q44:Q51)+SUM('Unit Pricing BAU'!Q4:Q11)","v":0},{"$f":"SUM('Unit Pricing BAU'!R44:R51)+SUM('Unit Pricing BAU'!R4:R11)","v":0},{"$f":"SUM('Unit Pricing BAU'!S44:S51)+SUM('Unit Pricing BAU'!S4:S11)","v":0},{"$f":"SUM('Unit Pricing BAU'!T44:T51)+SUM('Unit Pricing BAU'!T4:T11)","v":0},{"$f":"SUM('Unit Pricing BAU'!U44:U51)+SUM('Unit Pricing BAU'!U4:U11)","v":0},{"$f":"SUM('Unit Pricing BAU'!V44:V51)+SUM('Unit Pricing BAU'!V4:V11)","v":0},{"$f":"SUM('Unit Pricing BAU'!W44:W51)+SUM('Unit Pricing BAU'!W4:W11)","v":0},{"$f":"SUM('Unit Pricing BAU'!X44:X51)+SUM('Unit Pricing BAU'!X4:X11)","v":0},{"$f":"SUM('Unit Pricing BAU'!Y44:Y51)+SUM('Unit Pricing BAU'!Y4:Y11)","v":0},{"$f":"SUM('Unit Pricing BAU'!Z44:Z51)+SUM('Unit Pricing BAU'!Z4:Z11)","v":0},{"$f":"SUM('Unit Pricing BAU'!AA44:AA51)+SUM('Unit Pricing BAU'!AA4:AA11)","v":0},{"$f":"SUM('Unit Pricing BAU'!AB44:AB51)+SUM('Unit Pricing BAU'!AB4:AB11)","v":0},{"$f":"SUM('Unit Pricing BAU'!AC44:AC51)+SUM('Unit Pricing BAU'!AC4:AC11)","v":0},{"$f":"SUM('Unit Pricing BAU'!AD44:AD51)+SUM('Unit Pricing BAU'!AD4:AD11)","v":0},{"$f":"SUM('Unit Pricing BAU'!AE44:AE51)+SUM('Unit Pricing BAU'!AE4:AE11)","v":0}]
[null,null,"Energy",{"$f":"SUM(F10:Y10)","v":0},{"$f":"SUM('Unit Pricing BAU'!H21:H27)","v":0},{"$f":"SUM('Unit Pricing BAU'!J20:J27)","v":0},{"$f":"SUM('Unit Pricing BAU'!K20:K27)","v":0},{"$f":"SUM('Unit Pricing BAU'!L20:L27)","v":0},{"$f":"SUM('Unit Pricing BAU'!M20:M27)","v":0},{"$f":"SUM('Unit Pricing BAU'!N20:N27)","v":0},{"$f":"SUM('Unit Pricing BAU'!O20:O27)","v":0},{"$f":"SUM('Unit Pricing BAU'!P20:P27)","v":0},{"$f":"SUM('Unit Pricing BAU'!Q20:Q27)","v":0},{"$f":"SUM('Unit Pricing BAU'!R20:R27)","v":0},{"$f":"SUM('Unit Pricing BAU'!S20:S27)","v":0},{"$f":"SUM('Unit Pricing BAU'!T20:T27)","v":0},{"$f":"SUM('Unit Pricing BAU'!U20:U27)","v":0},{"$f":"SUM('Unit Pricing BAU'!V20:V27)","v":0},{"$f":"SUM('Unit Pricing BAU'!W20:W27)","v":0},{"$f":"SUM('Unit Pricing BAU'!X20:X27)","v":0},{"$f":"SUM('Unit Pricing BAU'!Y20:Y27)","v":0},{"$f":"SUM('Unit Pricing BAU'!Z37:Z41)","v":0},{"$f":"SUM('Unit Pricing BAU'!AA37:AA41)","v":0},{"$f":"SUM('Unit Pricing BAU'!AB37:AB41)","v":0},{"$f":"SUM('Unit Pricing BAU'!AC37:AC41)","v":0},{"$f":"SUM('Unit Pricing BAU'!AD37:AD41)","v":0}]
{"$rows_left_out":137}
{"sheet":"One Street Light Example","index":5,"n_rows":47,"n_cols":21,"rows_kept":47,"cut":false,"hidden":true,"merged":[[36,1,37,1],[27,1,28,1],[29,1,30,1],[31,1,32,1],[33,1,34,1],[3,1,4,1],[5,1,6,1],[7,1,8,1],[9,1,10,1],[12,1,13,1]]}
[null,null,null,null,null,null,"One Street Light Example 70 Watts 50% efficiency"]
[]
[null,null,null,null,2013,2014,2015,2016,2017,2018,2019,2020,2021,2022,2023,2024,2025,2026,2027,"Payback Period","Rate of Annual Savings"]
[null,"Lamp and Installation","HPS"]
[null,null,"LED",null,{"$f":"+'unit pricing 1-5 years scenario'!F6+'unit pricing 1-5 years scenario'!F14","v":375.9375}]
[null,"Maintenance","HPS",null,null,null,null,null,33.14,null,null,null,null,{"$f":"92.14+33.14","v":125.28},null,null,null,null,33.14]
[null,null,"LED",null,null,null,null,null,null,null,null,null,null,33]
[null,"Failures & Replacements","HPS",null,260,{"$f":"$I$6*0.1","v":3.3140000000000001},3.3140000000000001,3.3140000000000001,3.3140000000000001,3.3140000000000001,3.3140000000000001,3.3140000000000001,3.3140000000000001,3.3140000000000001,3.3140000000000001,3.3140000000000001,3.3140000000000001,3.3140000000000001,3.3140000000000001]
[null,null,"LED",null,{"$f":"($E$5*0.01)","v":3.7593749999999999},{"$f":"($E$5*0.01)","v":3.7593749999999999},3.7593749999999999,3.7593749999999999,3.7593749999999999,3.7593749999999999,3.7593749999999999,3.7593749999999999,3.7593749999999999,3.7593749999999999,3.7593749999999999,3.7593749999999999,3.7593749999999999,3.7593749999999999,3.7593749999999999]
[null,"Electricity","HPS",null,29.27,{"$f":"$E10","v":29.27},{"$f":"$E10","v":29.27},29.27,29.27,29.27,29.27,29.27,29.27,29.27,29.27,29.27,29.27,29.27,29.27]
{"$rows_left_out":38}
{"sheet":"Unit Pricing BAU","index":6,"n_rows":59,"n_cols":25,"rows_kept":59,"cut":false,"hidden":true,"merged":[]}
["quantity 50",{"$f":"+'Data Input and Instructions'!C26","v":0},null,null,"phases",5,null,"year =>","annual",1,{"$f":"1+J1","v":2},{"$f":"1+K1","v":3},4,5,6,7,8,9,10,11,12,{"$f":"1+U1","v":13},{"$f":"1+V1","v":14},{"$f":"1+W1","v":15},16]
["quantity 70",{"$f":"+'Data Input and Instructions'!$C$27","v":0},null,null,null,null,null,"HPS","adjustment",1,1,1,1,1,1,1,1,1,1,1,1,1,1,1,1]
["quantity 100",{"$f":"+'Data Input and Instructions'!C$28","v":0},null,null,null,null,null,"LED",null,0,0,0,0,{"$f":"N1/$F$1","v":1},1,1,1,1,1,1,1,1,1,1,1]
["quantity 150",{"$f":"+'Data Input and Instructions'!$C$29","v":0},null,null,"unit capital cost 50 watt  (Light bulbs only)",18,{"$f":"+$B$1","v":0},{"$f":"F4*G4","v":0},0.25,{"$f":"J$2*$H4*$I4","v":0},{"$f":"K$2*$H4*$I4*((1+$B$29)^J$1)","v":0},{"$f":"L$2*$H4*$I4*((1+$B$29)^K$1)","v":0},{"$f":"M$2*$H4*$I4*((1+$B$29)^L$1)","v":0},{"$f":"N$2*$H4*$I4*((1+$B$29)^M$1)","v":0},{"$f":"O$2*$H4*$I4*((1+$B$29)^N$1)","v":0},{"$f":"P$2*$H4*$I4*((1+$B$29)^O$1)","v":0},{"$f":"Q$2*$H4*$I4*((1+$B$29)^P$1)","v":0},{"$f":"R$2*$H4*$I4*((1+$B$29)^Q$1)","v":0},{"$f":"S$2*$H4*$I4*((1+$B$29)^R$1)","v":0},{"$f":"T$2*$H4*$I4*((1+$B$29)^S$1)","v":0},{"$f":"U$2*$H4*$I4*((1+$B$29)^T$1)","v":0},{"$f":"V$2*$H4*$I4*((1+$B$29)^U$1)","v":0},{"$f":"W$2*$H4*$I4*((1+$B$29)^V$1)","v":0},{"$f":"X$2*$H4*$I4*((1+$B$29)^W$1)","v":0},{"$f":"Y$2*$H4*$I4*((1+$B$29)^X$1)","v":0}]
["quantity 200",{"$f":"+'Data Input and Instructions'!$C$30","v":0},null,null,"unit capital cost 70 watt  (Light bulbs only)",14,{"$f":"+$B$2","v":0},{"$f":"F5*G5","v":0},0.25,0,0,0,0,0,0,0,0,0,0,0,0,0,0,0,0]
["quantity 250",{"$f":"+'Data Input and Instructions'!$C$31","v":0},null,null,"unit capital cost 100 watt  (Light bulbs only)",13,{"$f":"+$B$3","v":0},0,0.25,0,0,0,0,0,0,0,0,0,0,0,0,0,0,0,0]
["quantity 400",{"$f":"+'Data Input and Instructions'!C32","v":0},null,null,"unit capital cost 150 watt  (Light bulbs only)",13,{"$f":"+$B$4","v":0},0,0.25,0,0,0,0,0,0,0,0,0,0,0,0,0,0,0,0]
["quantity 1000",{"$f":"+'Data Input and Instructions'!C33","v":0},null,null,"unit capital cost 200 watt  (Light bulbs only)",15,{"$f":"+$B$5","v":0},0,0.25,0,0,0,0,0,0,0,0,0,0,0,0,0,0,0,0]
["Total",{"$f":"SUM(B1:B8)","v":0},null,null,"unit capital cost 250 watt  (Light bulbs only)",13,{"$f":"+$B$6","v":0},0,0.25,0,0,0,0,0,0,0,0,0,0,0,0,0,0,0,0]
[null,null,null,null,"unit capital cost 400 watt  (Light bulbs only)",13,{"$f":"+$B$7","v":0},0,0.25,0,0,0,0,0,0,0,0,0,0,0,0,0,0,0,0]
{"$rows_left_out":50}
{"sheet":"unit pricing 1-5 years scenario","index":7,"n_rows":169,"n_cols":25,"rows_kept":169,"cut":false,"hidden":true,"merged":[[1,4,2,4]]}
[]
[null,null,null,null,null,5,null,"year =>","annual",1,{"$f":"1+J2","v":2},{"$f":"1+K2","v":3},4,5,6,7,8,9,10,11,12,{"$f":"1+U2","v":13},{"$f":"1+V2","v":14},{"$f":"1+W2","v":15},16]
["quantity 50",{"$f":"+'Data Input and Instructions'!C26","v":0},null,null,null,null,null,"HPS","adjustment",{"$f":"IF('Data Input and Instructions'!$C$25>1,(1-(1/'Data Input and Instructions'!$C$25)),0)","v":0},{"$f":"IF('Data Input and Instructions'!C25<=2,0,(1-(1/'Data Input and Instructions'!C25)-J4))","v":0},{"$f":"IF('Data Input and Instructions'!C25<=3,0,(1-(1/'Data Input and Instructions'!C25)-K4))","v":0},{"$f":"IF('Data Input and Instructions'!C25<=4,0,(1-(1/'Data Input and Instructions'!C25)-L4))","v":0},{"$f":"IF('Data Input and Instructions'!C25<=5,0,(1/'Data Input and Instructions'!C25)-M4)","v":0},0,0,0,0,0,0,0,0,0,0,0]
["quantity 70",{"$f":"+'Data Input and Instructions'!$C$27","v":0},null,null,null,null,null,"LED",null,{"$f":"1-J3","v":1},{"$f":"IF(J3=0,1,1-K3)","v":1},{"$f":"IF(K3=0,1,1-L3)","v":1},{"$f":"IF(L3=0,1,1-M3)","v":1},{"$f":"IF(M3=0,1,1-N3)","v":1},1,1,1,1,1,1,1,1,1,1,1]
["quantity 100",{"$f":"+'Data Input and Instructions'!C28","v":0},null,null,"unit capital cost 50 watt LED (including procurement fee)",{"$f":"'Data Input and Instructions'!C39*(1+$B$54)","v":200.5},{"$f":"+$B$3","v":0},{"$f":"F5*G5","v":0},{"$f":"1-$B$13","v":0.9},{"$f":"$J$4*$H5*$I5^(J$2-1)","v":0},{"$f":"IF(AND($J$3=0,$J$4=1),0,($H5*$I5^(K$2-1)))","v":0},{"$f":"IF(AND($K$3=0,$K$4=1),0,($J$4*$H5*$I5^(L$2-1)))","v":0},{"$f":"IF(AND($L$3=0,$L$4=1),0,($J$4*$H5*$I5^(M$2-1)))","v":0},{"$f":"IF(AND($M$3=0,$M$4=1),0,($J$4*$H5*$I5^(N$2-1)))","v":0}]
["quantity 150",{"$f":"+'Data Input and Instructions'!$C$29","v":0},null,null,"unit capital cost 70 watt LED (including procurement fee)",{"$f":"'Data Input and Instructions'!C40*(1+$B$54)","v":215.53749999999999},{"$f":"+$B$4","v":0},0,0.9,0,{"$f":"IF(AND($J$3=0,$J$4=1),0,($J$4*$H6*$I6^(K$2-1)))","v":0},{"$f":"IF(AND($K$3=0,$K$4=1),0,($J$4*$H6*$I6^(L$2-1)))","v":0},{"$f":"IF(AND($L$3=0,$L$4=1),0,($J$4*$H6*$I6^(M$2-1)))","v":0},{"$f":"IF(AND($M$3=0,$M$4=1),0,($J$4*$H6*$I6^(N$2-1)))","v":0}]
["quantity 200",{"$f":"+'Data Input and Instructions'!$C$30","v":0},null,null,"unit capital cost 100 watt LED (including procurement fee)",{"$f":"'Data Input and Instructions'!C41*(1+$B$54)","v":242.25412499999999},{"$f":"+$B$5","v":0},0,0.9,0,{"$f":"IF(AND($J$3=0,$J$4=1),0,($J$4*$H7*$I7^(K$2-1)))","v":0},0,{"$f":"IF(AND($L$3=0,$L$4=1),0,($J$4*$H7*$I7^(M$2-1)))","v":0},0]
["quantity 250",{"$f":"+'Data Input and Instructions'!$C$31","v":0},null,null,"unit capital cost 150 watt LED (including procurement fee)",{"$f":"'Data Input and Instructions'!C42*(1+$B$54)","v":262.33420000000001},{"$f":"+$B$6","v":0},0,0.9,{"$f":"$J$4*$H8*$I8^(J$2-1)","v":0},0,0,0,0]
["quantity 400",{"$f":"+'Data Input and Instructions'!C32","v":0},null,null,"unit capital cost 200 watt LED (including procurement fee)",{"$f":"'Data Input and Instructions'!C43*(1+$B$54)","v":343.85749999999996},{"$f":"+$B$7","v":0},0,0.9,{"$f":"$J$4*$H9*$I9^(J$2-1)","v":0},0,0,0,0]
["quantity 1000",{"$f":"+'Data Input and Instructions'!C33","v":0},null,null,"unit capital cost 250 watt LED (including procurement fee)",{"$f":"'Data Input and Instructions'!C44*(1+$B$54)","v":418.67407499999996},{"$f":"+$B$8","v":0},0,0.9,{"$f":"$J$4*$H10*$I10^(J$2-1)","v":0},0,0,0,0]
{"$rows_left_out":160}
{"sheet":"ballast losses","index":8,"n_rows":10,"n_cols":6,"rows_kept":10,"cut":false,"hidden":true,"merged":[]}
["Nominal","Ballast Loss "]
[" Lamp Wattage  "," as a Percentage (%) of Lamp Wattage  "]
[50,{"$f":"+'Data Input and Instructions'!C50","v":0.35},null,50,{"$f":"+A3*B3","v":17.5},{"$f":"+D3+E3","v":67.5}]
[70,{"$f":"+'Data Input and Instructions'!C51","v":0.3},null,70,21,{"$f":"+D4+E4","v":91}]
[100,{"$f":"+'Data Input and Instructions'!C52","v":0.3},null,100,30,{"$f":"+D5+E5","v":130}]
[150,{"$f":"+'Data Input and Instructions'!C53","v":0.25},null,150,37.5,187.5]
[200,{"$f":"+'Data Input and Instructions'!C54","v":0.2},null,200,40,240]
[250,{"$f":"+'Data Input and Instructions'!C55","v":0.18},null,250,45,295]
[400,{"$f":"+'Data Input and Instructions'!C56","v":0.14000000000000001},null,400,56.000000000000007,{"$f":"+D9+E9","v":456}]
[1000,{"$f":"+'Data Input and Instructions'!C57","v":0.11},null,1000,110,1110]
{"$rows_left_out":1}
{"sheet":"GHG Calculator","index":9,"n_rows":388,"n_cols":9,"rows_kept":388,"cut":false,"hidden":true,"merged":[]}
["Overhead Street Lighting"]
["Electricity Usage Calculator"]
[]
["Enter latitude and lighting parameters below",null,null,null,null,null,"Estimated Usage:"]
["to calculate estimated electricity usage.",null,null,null,null,null,null,null,"Estimated"]
[null,null,null,null,null,"Month","Month","Night Hrs","Usage (kWh)"]
[null,null,null,null,null,1,"Jan",{"$f":"SUMIF(F$24:F$388,F7,I$24:I$388)","v":479.21874319809734},{"$f":"$C$20*H7/1000","v":0}]
["Latitude:",54.23,null,null,null,2,"Feb",396.55171460603327,0]
[null,null,null,null,null,3,"Mar",377.78706135093768,0]
["Lighting Parameters:",null,null,null,null,4,"Apr",301.81469047307002,0]
{"$rows_left_out":379}
{"sheet":"GHG savings","index":10,"n_rows":51,"n_cols":15,"rows_kept":51,"cut":false,"hidden":true,"merged":[[5,2,5,5],[6,2,8,2],[6,3,6,5],[7,3,7,5],[12,3,13,3],[12,4,13,4],[12,5,13,5]]}
[]
[]
[]
[]
[null,null,"British Columbia"]
[]
[null,null,"British Columbia","Greenhouse Gas Intensity1"]
[null,null,null,"(g GHG/kWh electricity generated)"]
[null,null,null,1990,2008,20092]
[null,null,"CO2 Intensity",17,26,24]
{"$rows_left_out":42}
{"sheet":"Assumptions","index":11,"n_rows":57,"n_cols":13,"rows_kept":57,"cut":false,"hidden":true,"merged":[[15,8,15,15],[41,1,41,16],[17,8,17,14],[33,1,33,6],[32,8,32,15],[33,8,33,15],[34,8,34,15],[37,8,37,13],[35,8,35,15],[38,8,38,13],[22,8,22,15],[18,8,18,15],[16,1,16,5],[29,8,29,15],[31,8,31,15],[28,8,28,15],[16,8,16,15],[19,8,19,15],[20,8,20,15],[21,8,21,15],[27,8,27,15],[36,8,36,15],[31,1,31,6],[35,1,35,6],[18,1,18,5],[23,8,23,12],[42,0,42,3],[43,0,43,3],[44,0,44,3],[45,0,45,3],[46,0,46,3],[50,0,50,3],[51,0,51,3],[49,0,49,3],[48,0,48,3],[47,0,47,3],[52,0,52,3],[53,0,53,3],[54,0,54,3],[55,0,55,3],[56,0,56,3]]}
[]
[]
[]
[]
[]
[]
[]
[]
[]
[]
{"$rows_left_out":47}