{"text_format":"1","workbook":"xlsx","n_sheets":3,"sheets":["Plot Planner","Final Area","Lookups"],"not_rendered":{"charts":0,"images":0,"macros":1,"external_links":0,"defined_names":0,"comments":0,"pivot_tables":0},"unopened":[],"bounds":{"document_bytes":16777216,"sheet_cells":100000,"rows_first":2000,"rows_last":500,"rows_between":2000,"halvings":0,"cell_chars":16384,"cell_head_chars":4096},"cells_cut":0,"cells_raw":0,"read":"whole","date_system":"1900"}

{"sheet":"Plot Planner","index":0,"n_rows":34,"n_cols":35,"rows_kept":34,"cut":false,"hidden":false,"merged":[[9,32,9,33],[4,0,4,1],[9,9,9,10],[9,26,9,28],[3,9,3,10],[3,23,3,24],[3,16,3,17],[9,16,9,17],[9,23,9,24]]}
["Aggregate Plot Calculator"]
["Version 1.0   July 18, 2019"]
[]
["RU",null,null,null,null,"Stratum",null,"Disp","Accm","Dispersed 1",null,null,"Stratum",null,"Disp","Accm","Dispersed 2",null,null,"Stratum",null,"Disp","Accm","Roadside 1",null,null,"Accumulation - Spot "]
["Latest Ready For Survey Date",null,null,null,null,"Min Plots","srs",{"$f":"ROUND((IF(F31<=10,10,IF(F31<=30,F31,IF(F31>=170,50,((F31-30)/7)+30)))),0)","v":10},{"$f":"ROUND((IF(F31<=10,10,IF(F31>=108,30,((F31-10)/5)+10))),0)","v":10},null,{"$f":"ROUND(IF($D$7=\"SRS\",IF(LEFT(J4,1)=\"D\",H5,I5),IF(LEFT(J4,1)=\"D\",H6,I6) ),0)","v":18},null,"Min Plots",null,{"$f":"ROUND((IF(M31<=10,10,IF(M31<=30,M31,IF(M31>=170,50,((M31-30)/7)+30)))),0)","v":10},{"$f":"ROUND((IF(M31<=10,10,IF(M31>=108,30,((M31-10)/5)+10))),0)","v":10},null,{"$f":"ROUND(IF($D$7=\"SRS\",IF(LEFT(Q4,1)=\"D\",O5,P5),IF(LEFT(Q4,1)=\"D\",O6,P6) ),0)","v":18},null,"Min Plots",null,{"$f":"ROUND((IF(T31<=10,10,IF(T31<=30,T31,IF(T31>=170,50,((T31-30)/7)+30)))),0)","v":10},{"$f":"ROUND((IF(U31<=10,10,IF(U31>=108,30,((U31-10)/5)+10))),0)","v":10},null,{"$f":"ROUND(IF($D$7=\"SRS\",IF(LEFT(X4,1)=\"D\",V5,W5),IF(LEFT(X4,1)=\"D\",V6,W6) ),0)","v":12},null,"Min Pile Plots",null,{"$f":"IF(D7=\"SRS\",AE5,AE6)","v":12},null,{"$f":"ROUND((IF(AC31<=10,10,IF(AC31>=108,30,((AC31-10)/5)+10))),0)","v":10},null,null,"Plot plan method"]
["SPIF",null,null,0.8,null,"Additional","ratio",{"$f":"IF(F31<20,18,IF(F31>=170,60,IF(F31>=20,(H5*1.2))))","v":18},{"$f":"(IF(F31<=12,12,IF(F31>=100,30,((F31-12)/5)+12)))","v":12},null,null,null,"Additional",null,{"$f":"IF(M31<20,18,IF(M31>=170,60,IF(M31>=20,(O5*1.2))))","v":18},{"$f":"(IF(M31<=12,12,IF(M31>=100,30,((M31-12)/5)+12)))","v":12},null,null,null,"Additional",null,{"$f":"IF(T31<20,18,IF(T31>=170,60,IF(T31>=20,(V5*1.2))))","v":18},{"$f":"(IF(U31<=12,12,IF(U31>=100,30,((U31-12)/5)+12)))","v":12},null,null,null,"Additional",null,null,null,{"$f":"ROUND((IF(AC31<=12,12,IF(AC31>=100,30,((AC31-12)/5)+12))),0)","v":12},null,null,"Estimate"]
["Survey Type",null,null,"Ratio",null,"Total Plots",null,null,null,null,{"$f":"K5+K6","v":18},null,"Total Plots",null,null,null,null,{"$f":"R5+R6","v":18},null,"Total Plots",null,null,null,null,{"$f":"Y5+Y6","v":12},null,"Total Pile Plots",null,{"$f":"AC5+AC6","v":12}]
[null,null,null,null,null,{"$f":"F31/(K7+0.01)","v":0},null,null,null,null,null,null,{"$f":"M31/(R7+0.0001)","v":0},null,null,null,null,null,null,{"$f":"T31/(Y7+0.0001)","v":0},null,null,null,null,null,null,null,{"$f":"AC31/AC7","v":0}]
[null,null,null,{"$f":"IF(D7=\"\",\"\",IF(D7=\"Ratio\", \"Select Interior (Ratio Aggregate) in EforWaste\", \"Select Interior (SRS Aggregate) in EforWaste\"))","v":"Select Interior (Ratio Aggregate) in EforWaste"},null,{"$f":"IF($D$7=\"ratio\",\"Measure\",\"\")","v":"Measure"},null,null,null,null,{"$f":"IFERROR(ROUND(IF($D$7=\"ratio\",K7/3,\"\"),0),\"\")","v":6},null,{"$f":"IF($D$7=\"ratio\",\"Measure\",\"\")","v":"Measure"},null,null,null,null,{"$f":"IFERROR(ROUND(IF($D$7=\"ratio\",R7/3,\"\"),0),\"\")","v":6},null,{"$f":"IF($D$7=\"ratio\",\"Measure\",\"\")","v":"Measure"},null,null,null,null,{"$f":"IFERROR(ROUND(IF($D$7=\"ratio\",Y7/3,\"\"),0),\"\")","v":4},null,{"$f":"IF($D$7=\"ratio\",\"Measure\",\"\")","v":"Measure"},null,{"$f":"IFERROR(ROUND(IF($D$7=\"ratio\",AC7/3,\"\"),0),\"\")","v":4}]
[null,null,null,"List blocks alphanumerically",null,null,null,null,null,"Plot Numbers to Establish",null,null,null,null,null,null,"Plot Numbers",null,null,null,null,null,null,"Plot Numbers",null,null,"No. of Piles \n(only one method can be used)",null,null,null,null,null,"Plot Numbers Allocated"]
["Block","Licence","CP","Block",null,"Area (ha)","Cumulative area",null,"Disp Plots","from","to",null,"Area (ha)","Cumulative area",null,"Disp Plots","from","to",null,"Area (ha)","Cumulative area",null,"Disp Plots","from","to",null,"Estimate","Actual","Piles","Cumulative Piles","Samples per block","Piles","from","to","*Important Note: Actual pile counts must be completed on all blocks when surveying in order to locate plots"]
[1,null,null,null,null,null,{"$f":"F12","v":0},{"$f":"IFERROR(VLOOKUP(G12,Table1[],2,TRUE),0)","v":150},{"$f":"H12","v":150},{"$f":"IF(K12=0,0,K12-I12+1)","v":0},{"$f":"IF(F12=\"\",0,H12)","v":0},null,null,{"$f":"M12","v":0},{"$f":"IFERROR(VLOOKUP(N12,Table2[],2,TRUE),0)","v":150},{"$f":"O12","v":150},{"$f":"IF(R12=0,0,R12-P12+1)","v":0},{"$f":"IF(M12=\"\",0,O12)","v":0},null,null,{"$f":"T12","v":0},{"$f":"IFERROR(VLOOKUP(U12,Table3[],2,TRUE),0)","v":150},{"$f":"V12","v":150},{"$f":"IF(Y12=0,0,Y12-W12+1)","v":0},{"$f":"IF(T12=\"\",0,V12)","v":0},null,{"$f":"ROUND((T12+M12+F12)*0.9,0)","v":0},null,{"$f":"IF($AH$6=\"Actual\",AB12,AA12)","v":0},{"$f":"AC12","v":0},{"$f":"IFERROR(VLOOKUP(AD12,Table4[],2,TRUE),0)","v":150},{"$f":"AE12","v":150},{"$f":"IF(AH12=0,0,AH12-AF12+1)","v":0},{"$f":"IF(AC12=0,0,AE12)","v":0}]
[2,null,null,null,null,null,{"$f":"F13+G12","v":0},{"$f":"IFERROR(VLOOKUP(G13,Table1[],2,TRUE),0)","v":150},{"$f":"H13-H12","v":0},0,{"$f":"IF(H13=H12,0,H13)","v":0},null,null,{"$f":"M13+N12","v":0},{"$f":"IFERROR(VLOOKUP(N13,Table2[],2,TRUE),0)","v":150},{"$f":"O13-O12","v":0},0,{"$f":"IF(O13=O12,0,O13)","v":0},null,null,{"$f":"T13+U12","v":0},{"$f":"IFERROR(VLOOKUP(U13,Table3[],2,TRUE),0)","v":150},{"$f":"V13-V12","v":0},{"$f":"IF(Y13=0,0,Y13-W13+1)","v":0},{"$f":"IF(V13=V12,0,V13)","v":0},null,{"$f":"ROUND((T13+M13+F13)*0.9,0)","v":0},null,0,{"$f":"AC13+AD12","v":0},{"$f":"IFERROR(VLOOKUP(AD13,Table4[],2,TRUE),0)","v":150},{"$f":"AE13-AE12","v":0},0,{"$f":"IF(AE13=AE12,0,AE13)","v":0}]
[3,null,null,null,null,null,0,{"$f":"IFERROR(VLOOKUP(G14,Table1[],2,TRUE),0)","v":150},{"$f":"H14-H13","v":0},0,0,null,null,0,{"$f":"IFERROR(VLOOKUP(N14,Table2[],2,TRUE),0)","v":150},{"$f":"O14-O13","v":0},0,0,null,null,0,{"$f":"IFERROR(VLOOKUP(U14,Table3[],2,TRUE),0)","v":150},{"$f":"V14-V13","v":0},0,0,null,0,null,0,{"$f":"AC14+AD13","v":0},{"$f":"IFERROR(VLOOKUP(AD14,Table4[],2,TRUE),0)","v":150},{"$f":"AE14-AE13","v":0},0,{"$f":"IF(AE14=AE13,0,AE14)","v":0}]
[4,null,null,null,null,null,0,{"$f":"IFERROR(VLOOKUP(G15,Table1[],2,TRUE),0)","v":150},0,0,0,null,null,0,{"$f":"IFERROR(VLOOKUP(N15,Table2[],2,TRUE),0)","v":150},0,0,0,null,null,0,{"$f":"IFERROR(VLOOKUP(U15,Table3[],2,TRUE),0)","v":150},0,0,0,null,0,null,0,0,{"$f":"IFERROR(VLOOKUP(AD15,Table4[],2,TRUE),0)","v":150},0,0,{"$f":"IF(AE15=AE14,0,AE15)","v":0}]
[5,null,null,null,null,null,0,{"$f":"IFERROR(VLOOKUP(G16,Table1[],2,TRUE),0)","v":150},0,0,0,null,null,0,{"$f":"IFERROR(VLOOKUP(N16,Table2[],2,TRUE),0)","v":150},0,0,0,null,null,0,{"$f":"IFERROR(VLOOKUP(U16,Table3[],2,TRUE),0)","v":150},0,0,0,null,0,null,0,0,{"$f":"IFERROR(VLOOKUP(AD16,Table4[],2,TRUE),0)","v":150},0,0,{"$f":"IF(AE16=AE15,0,AE16)","v":0}]
[6,null,null,null,null,null,0,{"$f":"IFERROR(VLOOKUP(G17,Table1[],2,TRUE),0)","v":150},0,0,0,null,null,0,{"$f":"IFERROR(VLOOKUP(N17,Table2[],2,TRUE),0)","v":150},0,0,0,null,null,0,{"$f":"IFERROR(VLOOKUP(U17,Table3[],2,TRUE),0)","v":150},0,0,0,null,0,null,0,0,{"$f":"IFERROR(VLOOKUP(AD17,Table4[],2,TRUE),0)","v":150},0,0,{"$f":"IF(AE17=AE16,0,AE17)","v":0}]
[7,null,null,null,null,null,0,{"$f":"IFERROR(VLOOKUP(G18,Table1[],2,TRUE),0)","v":150},0,0,0,null,null,0,{"$f":"IFERROR(VLOOKUP(N18,Table2[],2,TRUE),0)","v":150},0,0,0,null,null,0,{"$f":"IFERROR(VLOOKUP(U18,Table3[],2,TRUE),0)","v":150},0,0,0,null,0,null,0,0,{"$f":"IFERROR(VLOOKUP(AD18,Table4[],2,TRUE),0)","v":150},{"$f":"AE18-AE17","v":0},{"$f":"IF(AH18=0,0,AH18-AF18+1)","v":0},{"$f":"IF(AE18=AE17,0,AE18)","v":0}]
[8,null,null,null,null,null,0,{"$f":"IFERROR(VLOOKUP(G19,Table1[],2,TRUE),0)","v":150},0,0,0,null,null,0,{"$f":"IFERROR(VLOOKUP(N19,Table2[],2,TRUE),0)","v":150},0,0,0,null,null,0,{"$f":"IFERROR(VLOOKUP(U19,Table3[],2,TRUE),0)","v":150},0,0,0,null,0,null,0,0,{"$f":"IFERROR(VLOOKUP(AD19,Table4[],2,TRUE),0)","v":150},0,0,0]
[9,null,null,null,null,null,0,{"$f":"IFERROR(VLOOKUP(G20,Table1[],2,TRUE),0)","v":150},0,0,0,null,null,0,{"$f":"IFERROR(VLOOKUP(N20,Table2[],2,TRUE),0)","v":150},0,0,0,null,null,0,{"$f":"IFERROR(VLOOKUP(U20,Table3[],2,TRUE),0)","v":150},0,0,0,null,0,null,0,0,{"$f":"IFERROR(VLOOKUP(AD20,Table4[],2,TRUE),0)","v":150},0,0,0]
[10,null,null,null,null,null,0,{"$f":"IFERROR(VLOOKUP(G21,Table1[],2,TRUE),0)","v":150},0,0,0,null,null,0,{"$f":"IFERROR(VLOOKUP(N21,Table2[],2,TRUE),0)","v":150},0,0,0,null,null,0,{"$f":"IFERROR(VLOOKUP(U21,Table3[],2,TRUE),0)","v":150},0,0,0,null,0,null,0,0,{"$f":"IFERROR(VLOOKUP(AD21,Table4[],2,TRUE),0)","v":150},0,0,0]
[11,null,null,null,null,null,0,{"$f":"IFERROR(VLOOKUP(G22,Table1[],2,TRUE),0)","v":150},0,0,0,null,null,0,{"$f":"IFERROR(VLOOKUP(N22,Table2[],2,TRUE),0)","v":150},0,0,0,null,null,0,{"$f":"IFERROR(VLOOKUP(U22,Table3[],2,TRUE),0)","v":150},0,0,0,null,0,null,0,0,{"$f":"IFERROR(VLOOKUP(AD22,Table4[],2,TRUE),0)","v":150},0,0,0]
[12,null,null,null,null,null,0,{"$f":"IFERROR(VLOOKUP(G23,Table1[],2,TRUE),0)","v":150},0,0,0,null,null,0,{"$f":"IFERROR(VLOOKUP(N23,Table2[],2,TRUE),0)","v":150},0,0,0,null,null,0,{"$f":"IFERROR(VLOOKUP(U23,Table3[],2,TRUE),0)","v":150},0,0,0,null,0,null,0,0,{"$f":"IFERROR(VLOOKUP(AD23,Table4[],2,TRUE),0)","v":150},0,0,0]
[13,null,null,null,null,null,0,{"$f":"IFERROR(VLOOKUP(G24,Table1[],2,TRUE),0)","v":150},0,0,0,null,null,0,{"$f":"IFERROR(VLOOKUP(N24,Table2[],2,TRUE),0)","v":150},0,0,0,null,null,0,{"$f":"IFERROR(VLOOKUP(U24,Table3[],2,TRUE),0)","v":150},0,0,0,null,0,null,0,0,{"$f":"IFERROR(VLOOKUP(AD24,Table4[],2,TRUE),0)","v":150},0,0,0]
[14,null,null,null,null,null,0,{"$f":"IFERROR(VLOOKUP(G25,Table1[],2,TRUE),0)","v":150},0,0,0,null,null,0,{"$f":"IFERROR(VLOOKUP(N25,Table2[],2,TRUE),0)","v":150},0,0,0,null,null,0,{"$f":"IFERROR(VLOOKUP(U25,Table3[],2,TRUE),0)","v":150},0,0,0,null,0,null,0,0,{"$f":"IFERROR(VLOOKUP(AD25,Table4[],2,TRUE),0)","v":150},0,0,0]
[15,null,null,null,null,null,0,{"$f":"IFERROR(VLOOKUP(G26,Table1[],2,TRUE),0)","v":150},0,0,0,null,null,0,{"$f":"IFERROR(VLOOKUP(N26,Table2[],2,TRUE),0)","v":150},0,0,0,null,null,0,{"$f":"IFERROR(VLOOKUP(U26,Table3[],2,TRUE),0)","v":150},0,0,0,null,0,null,0,0,{"$f":"IFERROR(VLOOKUP(AD26,Table4[],2,TRUE),0)","v":150},0,0,0]
[16,null,null,null,null,null,0,{"$f":"IFERROR(VLOOKUP(G27,Table1[],2,TRUE),0)","v":150},0,0,0,null,null,0,{"$f":"IFERROR(VLOOKUP(N27,Table2[],2,TRUE),0)","v":150},0,0,0,null,null,0,{"$f":"IFERROR(VLOOKUP(U27,Table3[],2,TRUE),0)","v":150},0,0,0,null,0,null,0,0,{"$f":"IFERROR(VLOOKUP(AD27,Table4[],2,TRUE),0)","v":150},0,0,0]
[17,null,null,null,null,null,0,{"$f":"IFERROR(VLOOKUP(G28,Table1[],2,TRUE),0)","v":150},0,0,0,null,null,0,{"$f":"IFERROR(VLOOKUP(N28,Table2[],2,TRUE),0)","v":150},0,0,0,null,null,0,{"$f":"IFERROR(VLOOKUP(U28,Table3[],2,TRUE),0)","v":150},0,0,0,null,0,null,0,0,{"$f":"IFERROR(VLOOKUP(AD28,Table4[],2,TRUE),0)","v":150},0,0,0]
[18,null,null,null,null,null,0,{"$f":"IFERROR(VLOOKUP(G29,Table1[],2,TRUE),0)","v":150},0,0,0,null,null,0,{"$f":"IFERROR(VLOOKUP(N29,Table2[],2,TRUE),0)","v":150},0,0,0,null,null,0,{"$f":"IFERROR(VLOOKUP(U29,Table3[],2,TRUE),0)","v":150},0,0,0,null,0,null,0,0,{"$f":"IFERROR(VLOOKUP(AD29,Table4[],2,TRUE),0)","v":150},0,0,0]
[19,null,null,null,null,null,0,{"$f":"IFERROR(VLOOKUP(G30,Table1[],2,TRUE),0)","v":150},0,0,0,null,null,0,{"$f":"IFERROR(VLOOKUP(N30,Table2[],2,TRUE),0)","v":150},0,0,0,null,null,0,{"$f":"IFERROR(VLOOKUP(U30,Table3[],2,TRUE),0)","v":150},0,0,0,null,0,null,0,0,{"$f":"IFERROR(VLOOKUP(AD30,Table4[],2,TRUE),0)","v":150},0,0,0]
["Totals",null,null,null,null,{"$f":"SUM(F12:F30)","v":0},null,null,null,null,null,null,{"$f":"SUM(M12:M30)","v":0},null,null,null,null,null,null,{"$f":"SUM(T12:T30)","v":0},null,null,null,null,null,null,{"$f":"SUM(AA12:AA30)","v":0},null,{"$f":"SUM(AC12:AC30)","v":0},null,{"$f":"SUM(AE12:AE30)","v":2850}]
[]
["Spot Accumulation Area"]
["Total Aggregate Area for Eforwaste",null,null,{"$f":"F31+M31+T31+D33","v":0}]

{"sheet":"Final Area","index":1,"n_rows":29,"n_cols":11,"rows_kept":29,"cut":false,"hidden":false,"merged":[[3,1,3,3],[4,9,5,9]]}
["Aggregate Plot Calculator"]
["Version 1.0 "]
[]
[]
[null,null,null,null,null,null,null,null,{"$f":"'Plot Planner'!AA4","v":"Accumulation - Spot "},"Other Stratum (ha) e.g. standing tree"]
["Block","Licence","CP","Block Name ",null,{"$f":"'Plot Planner'!J4","v":"Dispersed 1"},{"$f":"'Plot Planner'!Q4","v":"Dispersed 2"},{"$f":"'Plot Planner'!X4","v":"Roadside 1"},"Area (ha)",null,"Total"]
[1,{"$f":"'Plot Planner'!B12","v":0},{"$f":"'Plot Planner'!C12","v":0},{"$f":"'Plot Planner'!D12","v":0},null,null,null,null,null,null,{"$f":"SUM(F7:J7)","v":0}]
[2,{"$f":"'Plot Planner'!B13","v":0},{"$f":"'Plot Planner'!C13","v":0},{"$f":"'Plot Planner'!D13","v":0},null,null,null,null,null,null,{"$f":"SUM(F8:J8)","v":0}]
[3,{"$f":"'Plot Planner'!B14","v":0},{"$f":"'Plot Planner'!C14","v":0},{"$f":"'Plot Planner'!D14","v":0},null,null,null,null,null,null,0]
[4,{"$f":"'Plot Planner'!B15","v":0},{"$f":"'Plot Planner'!C15","v":0},{"$f":"'Plot Planner'!D15","v":0},null,null,null,null,null,null,0]
[5,{"$f":"'Plot Planner'!B16","v":0},{"$f":"'Plot Planner'!C16","v":0},{"$f":"'Plot Planner'!D16","v":0},null,null,null,null,null,null,0]
[6,{"$f":"'Plot Planner'!B17","v":0},{"$f":"'Plot Planner'!C17","v":0},{"$f":"'Plot Planner'!D17","v":0},null,null,null,null,null,null,0]
[7,{"$f":"'Plot Planner'!B18","v":0},{"$f":"'Plot Planner'!C18","v":0},{"$f":"'Plot Planner'!D18","v":0},null,null,null,null,null,null,0]
[8,{"$f":"'Plot Planner'!B19","v":0},{"$f":"'Plot Planner'!C19","v":0},{"$f":"'Plot Planner'!D19","v":0},null,null,null,null,null,null,0]
[9,{"$f":"'Plot Planner'!B20","v":0},{"$f":"'Plot Planner'!C20","v":0},{"$f":"'Plot Planner'!D20","v":0},null,null,null,null,null,null,0]
[10,{"$f":"'Plot Planner'!B21","v":0},{"$f":"'Plot Planner'!C21","v":0},{"$f":"'Plot Planner'!D21","v":0},null,null,null,null,null,null,0]
[11,{"$f":"'Plot Planner'!B22","v":0},{"$f":"'Plot Planner'!C22","v":0},{"$f":"'Plot Planner'!D22","v":0},null,null,null,null,null,null,0]
[12,{"$f":"'Plot Planner'!B23","v":0},{"$f":"'Plot Planner'!C23","v":0},{"$f":"'Plot Planner'!D23","v":0},null,null,null,null,null,null,0]
[13,{"$f":"'Plot Planner'!B24","v":0},{"$f":"'Plot Planner'!C24","v":0},{"$f":"'Plot Planner'!D24","v":0},null,null,null,null,null,null,0]
[14,{"$f":"'Plot Planner'!B25","v":0},{"$f":"'Plot Planner'!C25","v":0},{"$f":"'Plot Planner'!D25","v":0},null,null,null,null,null,null,0]
[15,{"$f":"'Plot Planner'!B26","v":0},{"$f":"'Plot Planner'!C26","v":0},{"$f":"'Plot Planner'!D26","v":0},null,null,null,null,null,null,0]
[16,{"$f":"'Plot Planner'!B27","v":0},{"$f":"'Plot Planner'!C27","v":0},{"$f":"'Plot Planner'!D27","v":0},null,null,null,null,null,null,0]
[17,{"$f":"'Plot Planner'!B28","v":0},{"$f":"'Plot Planner'!C28","v":0},{"$f":"'Plot Planner'!D28","v":0},null,null,null,null,null,null,0]
[18,{"$f":"'Plot Planner'!B29","v":0},{"$f":"'Plot Planner'!C29","v":0},{"$f":"'Plot Planner'!D29","v":0},null,null,null,null,null,null,0]
[19,{"$f":"'Plot Planner'!B30","v":0},{"$f":"'Plot Planner'!C30","v":0},{"$f":"'Plot Planner'!D30","v":0},null,null,null,null,null,null,0]
["Totals",null,null,null,null,{"$f":"SUM(F7:F25)","v":0},{"$f":"SUM(G7:G25)","v":0},{"$f":"SUM(H7:H25)","v":0},0,0,{"$f":"SUM(K7:K25)","v":0}]
[]
[]
["Total Aggregate Area for Eforwaste",null,null,{"$f":"SUM(F26:J26)","v":0}]

{"sheet":"Lookups","index":2,"n_rows":157,"n_cols":12,"rows_kept":157,"cut":false,"hidden":true,"merged":[]}
[]
[]
[]
[]
[]
[null,"Stratum 1 - Dispersed",null,null,"Stratum 2 - Dispersed",null,null,"Stratum 3 - Dispersed",null,null,"Stratum 4 - Accumulations"]
[null,"Cumulative Area","Plots",null,"Cumulative Area","Plots",null,"Cumulative Area","Plots",null,"Cumulative Area","Plots"]
[null,{"$f":"('Plot Planner'!$F$8*'Plot Planner'!D6)","v":0},1,null,{"$f":"'Plot Planner'!M8*'Plot Planner'!D6","v":0},1,null,{"$f":"'Plot Planner'!T8*'Plot Planner'!D6","v":0},1,null,{"$f":"'Plot Planner'!AB8*'Plot Planner'!D6","v":0},1]
[null,{"$f":"B8+'Plot Planner'!$F$8","v":0},2,null,{"$f":"E8+'Plot Planner'!$M$8","v":0},2,null,{"$f":"H8+'Plot Planner'!$T$8","v":0},2,null,{"$f":"K8+'Plot Planner'!$AB$8","v":0},2]
[null,{"$f":"B9+'Plot Planner'!$F$8","v":0},3,null,{"$f":"E9+'Plot Planner'!$M$8","v":0},3,null,{"$f":"H9+'Plot Planner'!$T$8","v":0},3,null,{"$f":"K9+'Plot Planner'!$AB$8","v":0},3]
[null,{"$f":"B10+'Plot Planner'!$F$8","v":0},4,null,{"$f":"E10+'Plot Planner'!$M$8","v":0},4,null,{"$f":"H10+'Plot Planner'!$T$8","v":0},4,null,{"$f":"K10+'Plot Planner'!$AB$8","v":0},4]
[null,{"$f":"B11+'Plot Planner'!$F$8","v":0},5,null,{"$f":"E11+'Plot Planner'!$M$8","v":0},5,null,{"$f":"H11+'Plot Planner'!$T$8","v":0},5,null,{"$f":"K11+'Plot Planner'!$AB$8","v":0},5]
[null,{"$f":"B12+'Plot Planner'!$F$8","v":0},6,null,{"$f":"E12+'Plot Planner'!$M$8","v":0},6,null,{"$f":"H12+'Plot Planner'!$T$8","v":0},6,null,{"$f":"K12+'Plot Planner'!$AB$8","v":0},6]
[null,{"$f":"B13+'Plot Planner'!$F$8","v":0},7,null,{"$f":"E13+'Plot Planner'!$M$8","v":0},7,null,{"$f":"H13+'Plot Planner'!$T$8","v":0},7,null,{"$f":"K13+'Plot Planner'!$AB$8","v":0},7]
[null,{"$f":"B14+'Plot Planner'!$F$8","v":0},8,null,{"$f":"E14+'Plot Planner'!$M$8","v":0},8,null,{"$f":"H14+'Plot Planner'!$T$8","v":0},8,null,{"$f":"K14+'Plot Planner'!$AB$8","v":0},8]
[null,{"$f":"B15+'Plot Planner'!$F$8","v":0},9,null,{"$f":"E15+'Plot Planner'!$M$8","v":0},9,null,{"$f":"H15+'Plot Planner'!$T$8","v":0},9,null,{"$f":"K15+'Plot Planner'!$AB$8","v":0},9]
[null,{"$f":"B16+'Plot Planner'!$F$8","v":0},10,null,{"$f":"E16+'Plot Planner'!$M$8","v":0},10,null,{"$f":"H16+'Plot Planner'!$T$8","v":0},10,null,{"$f":"K16+'Plot Planner'!$AB$8","v":0},10]
[null,{"$f":"B17+'Plot Planner'!$F$8","v":0},11,null,{"$f":"E17+'Plot Planner'!$M$8","v":0},11,null,{"$f":"H17+'Plot Planner'!$T$8","v":0},11,null,{"$f":"K17+'Plot Planner'!$AB$8","v":0},11]
[null,{"$f":"B18+'Plot Planner'!$F$8","v":0},12,null,{"$f":"E18+'Plot Planner'!$M$8","v":0},12,null,{"$f":"H18+'Plot Planner'!$T$8","v":0},12,null,{"$f":"K18+'Plot Planner'!$AB$8","v":0},12]
[null,{"$f":"B19+'Plot Planner'!$F$8","v":0},13,null,{"$f":"E19+'Plot Planner'!$M$8","v":0},13,null,{"$f":"H19+'Plot Planner'!$T$8","v":0},13,null,{"$f":"K19+'Plot Planner'!$AB$8","v":0},13]
[null,{"$f":"B20+'Plot Planner'!$F$8","v":0},14,null,{"$f":"E20+'Plot Planner'!$M$8","v":0},14,null,{"$f":"H20+'Plot Planner'!$T$8","v":0},14,null,{"$f":"K20+'Plot Planner'!$AB$8","v":0},14]
[null,{"$f":"B21+'Plot Planner'!$F$8","v":0},15,null,{"$f":"E21+'Plot Planner'!$M$8","v":0},15,null,{"$f":"H21+'Plot Planner'!$T$8","v":0},15,null,{"$f":"K21+'Plot Planner'!$AB$8","v":0},15]
[null,{"$f":"B22+'Plot Planner'!$F$8","v":0},16,null,{"$f":"E22+'Plot Planner'!$M$8","v":0},16,null,{"$f":"H22+'Plot Planner'!$T$8","v":0},16,null,{"$f":"K22+'Plot Planner'!$AB$8","v":0},16]
[null,{"$f":"B23+'Plot Planner'!$F$8","v":0},17,null,{"$f":"E23+'Plot Planner'!$M$8","v":0},17,null,{"$f":"H23+'Plot Planner'!$T$8","v":0},17,null,{"$f":"K23+'Plot Planner'!$AB$8","v":0},17]
[null,{"$f":"B24+'Plot Planner'!$F$8","v":0},18,null,{"$f":"E24+'Plot Planner'!$M$8","v":0},18,null,{"$f":"H24+'Plot Planner'!$T$8","v":0},18,null,{"$f":"K24+'Plot Planner'!$AB$8","v":0},18]
[null,{"$f":"B25+'Plot Planner'!$F$8","v":0},19,null,{"$f":"E25+'Plot Planner'!$M$8","v":0},19,null,{"$f":"H25+'Plot Planner'!$T$8","v":0},19,null,{"$f":"K25+'Plot Planner'!$AB$8","v":0},19]
[null,{"$f":"B26+'Plot Planner'!$F$8","v":0},20,null,{"$f":"E26+'Plot Planner'!$M$8","v":0},20,null,{"$f":"H26+'Plot Planner'!$T$8","v":0},20,null,{"$f":"K26+'Plot Planner'!$AB$8","v":0},20]
[null,{"$f":"B27+'Plot Planner'!$F$8","v":0},21,null,{"$f":"E27+'Plot Planner'!$M$8","v":0},21,null,{"$f":"H27+'Plot Planner'!$T$8","v":0},21,null,{"$f":"K27+'Plot Planner'!$AB$8","v":0},21]
[null,{"$f":"B28+'Plot Planner'!$F$8","v":0},22,null,{"$f":"E28+'Plot Planner'!$M$8","v":0},22,null,{"$f":"H28+'Plot Planner'!$T$8","v":0},22,null,{"$f":"K28+'Plot Planner'!$AB$8","v":0},22]
[null,{"$f":"B29+'Plot Planner'!$F$8","v":0},23,null,{"$f":"E29+'Plot Planner'!$M$8","v":0},23,null,{"$f":"H29+'Plot Planner'!$T$8","v":0},23,null,{"$f":"K29+'Plot Planner'!$AB$8","v":0},23]
[null,{"$f":"B30+'Plot Planner'!$F$8","v":0},24,null,{"$f":"E30+'Plot Planner'!$M$8","v":0},24,null,{"$f":"H30+'Plot Planner'!$T$8","v":0},24,null,{"$f":"K30+'Plot Planner'!$AB$8","v":0},24]
[null,{"$f":"B31+'Plot Planner'!$F$8","v":0},25,null,{"$f":"E31+'Plot Planner'!$M$8","v":0},25,null,{"$f":"H31+'Plot Planner'!$T$8","v":0},25,null,{"$f":"K31+'Plot Planner'!$AB$8","v":0},25]
[null,{"$f":"B32+'Plot Planner'!$F$8","v":0},26,null,{"$f":"E32+'Plot Planner'!$M$8","v":0},26,null,{"$f":"H32+'Plot Planner'!$T$8","v":0},26,null,{"$f":"K32+'Plot Planner'!$AB$8","v":0},26]
[null,{"$f":"B33+'Plot Planner'!$F$8","v":0},27,null,{"$f":"E33+'Plot Planner'!$M$8","v":0},27,null,{"$f":"H33+'Plot Planner'!$T$8","v":0},27,null,{"$f":"K33+'Plot Planner'!$AB$8","v":0},27]
[null,{"$f":"B34+'Plot Planner'!$F$8","v":0},28,null,{"$f":"E34+'Plot Planner'!$M$8","v":0},28,null,{"$f":"H34+'Plot Planner'!$T$8","v":0},28,null,{"$f":"K34+'Plot Planner'!$AB$8","v":0},28]
[null,{"$f":"B35+'Plot Planner'!$F$8","v":0},29,null,{"$f":"E35+'Plot Planner'!$M$8","v":0},29,null,{"$f":"H35+'Plot Planner'!$T$8","v":0},29,null,{"$f":"K35+'Plot Planner'!$AB$8","v":0},29]
[null,{"$f":"B36+'Plot Planner'!$F$8","v":0},30,null,{"$f":"E36+'Plot Planner'!$M$8","v":0},30,null,{"$f":"H36+'Plot Planner'!$T$8","v":0},30,null,{"$f":"K36+'Plot Planner'!$AB$8","v":0},30]
[null,{"$f":"B37+'Plot Planner'!$F$8","v":0},31,null,{"$f":"E37+'Plot Planner'!$M$8","v":0},31,null,{"$f":"H37+'Plot Planner'!$T$8","v":0},31,null,{"$f":"K37+'Plot Planner'!$AB$8","v":0},31]
[null,{"$f":"B38+'Plot Planner'!$F$8","v":0},32,null,{"$f":"E38+'Plot Planner'!$M$8","v":0},32,null,{"$f":"H38+'Plot Planner'!$T$8","v":0},32,null,{"$f":"K38+'Plot Planner'!$AB$8","v":0},32]
[null,{"$f":"B39+'Plot Planner'!$F$8","v":0},33,null,{"$f":"E39+'Plot Planner'!$M$8","v":0},33,null,{"$f":"H39+'Plot Planner'!$T$8","v":0},33,null,{"$f":"K39+'Plot Planner'!$AB$8","v":0},33]
[null,{"$f":"B40+'Plot Planner'!$F$8","v":0},34,null,{"$f":"E40+'Plot Planner'!$M$8","v":0},34,null,{"$f":"H40+'Plot Planner'!$T$8","v":0},34,null,{"$f":"K40+'Plot Planner'!$AB$8","v":0},34]
[null,{"$f":"B41+'Plot Planner'!$F$8","v":0},35,null,{"$f":"E41+'Plot Planner'!$M$8","v":0},35,null,{"$f":"H41+'Plot Planner'!$T$8","v":0},35,null,{"$f":"K41+'Plot Planner'!$AB$8","v":0},35]
[null,{"$f":"B42+'Plot Planner'!$F$8","v":0},36,null,{"$f":"E42+'Plot Planner'!$M$8","v":0},36,null,{"$f":"H42+'Plot Planner'!$T$8","v":0},36,null,{"$f":"K42+'Plot Planner'!$AB$8","v":0},36]
[null,{"$f":"B43+'Plot Planner'!$F$8","v":0},37,null,{"$f":"E43+'Plot Planner'!$M$8","v":0},37,null,{"$f":"H43+'Plot Planner'!$T$8","v":0},37,null,{"$f":"K43+'Plot Planner'!$AB$8","v":0},37]
[null,{"$f":"B44+'Plot Planner'!$F$8","v":0},38,null,{"$f":"E44+'Plot Planner'!$M$8","v":0},38,null,{"$f":"H44+'Plot Planner'!$T$8","v":0},38,null,{"$f":"K44+'Plot Planner'!$AB$8","v":0},38]
[null,{"$f":"B45+'Plot Planner'!$F$8","v":0},39,null,{"$f":"E45+'Plot Planner'!$M$8","v":0},39,null,{"$f":"H45+'Plot Planner'!$T$8","v":0},39,null,{"$f":"K45+'Plot Planner'!$AB$8","v":0},39]
[null,{"$f":"B46+'Plot Planner'!$F$8","v":0},40,null,{"$f":"E46+'Plot Planner'!$M$8","v":0},40,null,{"$f":"H46+'Plot Planner'!$T$8","v":0},40,null,{"$f":"K46+'Plot Planner'!$AB$8","v":0},40]
[null,{"$f":"B47+'Plot Planner'!$F$8","v":0},41,null,{"$f":"E47+'Plot Planner'!$M$8","v":0},41,null,{"$f":"H47+'Plot Planner'!$T$8","v":0},41,null,{"$f":"K47+'Plot Planner'!$AB$8","v":0},41]
[null,{"$f":"B48+'Plot Planner'!$F$8","v":0},42,null,{"$f":"E48+'Plot Planner'!$M$8","v":0},42,null,{"$f":"H48+'Plot Planner'!$T$8","v":0},42,null,{"$f":"K48+'Plot Planner'!$AB$8","v":0},42]
[null,{"$f":"B49+'Plot Planner'!$F$8","v":0},43,null,{"$f":"E49+'Plot Planner'!$M$8","v":0},43,null,{"$f":"H49+'Plot Planner'!$T$8","v":0},43,null,{"$f":"K49+'Plot Planner'!$AB$8","v":0},43]
[null,{"$f":"B50+'Plot Planner'!$F$8","v":0},44,null,{"$f":"E50+'Plot Planner'!$M$8","v":0},44,null,{"$f":"H50+'Plot Planner'!$T$8","v":0},44,null,{"$f":"K50+'Plot Planner'!$AB$8","v":0},44]
[null,{"$f":"B51+'Plot Planner'!$F$8","v":0},45,null,{"$f":"E51+'Plot Planner'!$M$8","v":0},45,null,{"$f":"H51+'Plot Planner'!$T$8","v":0},45,null,{"$f":"K51+'Plot Planner'!$AB$8","v":0},45]
[null,{"$f":"B52+'Plot Planner'!$F$8","v":0},46,null,{"$f":"E52+'Plot Planner'!$M$8","v":0},46,null,{"$f":"H52+'Plot Planner'!$T$8","v":0},46,null,{"$f":"K52+'Plot Planner'!$AB$8","v":0},46]
[null,{"$f":"B53+'Plot Planner'!$F$8","v":0},47,null,{"$f":"E53+'Plot Planner'!$M$8","v":0},47,null,{"$f":"H53+'Plot Planner'!$T$8","v":0},47,null,{"$f":"K53+'Plot Planner'!$AB$8","v":0},47]
[null,{"$f":"B54+'Plot Planner'!$F$8","v":0},48,null,{"$f":"E54+'Plot Planner'!$M$8","v":0},48,null,{"$f":"H54+'Plot Planner'!$T$8","v":0},48,null,{"$f":"K54+'Plot Planner'!$AB$8","v":0},48]
[null,{"$f":"B55+'Plot Planner'!$F$8","v":0},49,null,{"$f":"E55+'Plot Planner'!$M$8","v":0},49,null,{"$f":"H55+'Plot Planner'!$T$8","v":0},49,null,{"$f":"K55+'Plot Planner'!$AB$8","v":0},49]
[null,{"$f":"B56+'Plot Planner'!$F$8","v":0},50,null,{"$f":"E56+'Plot Planner'!$M$8","v":0},50,null,{"$f":"H56+'Plot Planner'!$T$8","v":0},50,null,{"$f":"K56+'Plot Planner'!$AB$8","v":0},50]
[null,{"$f":"B57+'Plot Planner'!$F$8","v":0},51,null,{"$f":"E57+'Plot Planner'!$M$8","v":0},51,null,{"$f":"H57+'Plot Planner'!$T$8","v":0},51,null,{"$f":"K57+'Plot Planner'!$AB$8","v":0},51]
[null,{"$f":"B58+'Plot Planner'!$F$8","v":0},52,null,{"$f":"E58+'Plot Planner'!$M$8","v":0},52,null,{"$f":"H58+'Plot Planner'!$T$8","v":0},52,null,{"$f":"K58+'Plot Planner'!$AB$8","v":0},52]
[null,{"$f":"B59+'Plot Planner'!$F$8","v":0},53,null,{"$f":"E59+'Plot Planner'!$M$8","v":0},53,null,{"$f":"H59+'Plot Planner'!$T$8","v":0},53,null,{"$f":"K59+'Plot Planner'!$AB$8","v":0},53]
[null,{"$f":"B60+'Plot Planner'!$F$8","v":0},54,null,{"$f":"E60+'Plot Planner'!$M$8","v":0},54,null,{"$f":"H60+'Plot Planner'!$T$8","v":0},54,null,{"$f":"K60+'Plot Planner'!$AB$8","v":0},54]
[null,{"$f":"B61+'Plot Planner'!$F$8","v":0},55,null,{"$f":"E61+'Plot Planner'!$M$8","v":0},55,null,{"$f":"H61+'Plot Planner'!$T$8","v":0},55,null,{"$f":"K61+'Plot Planner'!$AB$8","v":0},55]
[null,{"$f":"B62+'Plot Planner'!$F$8","v":0},56,null,{"$f":"E62+'Plot Planner'!$M$8","v":0},56,null,{"$f":"H62+'Plot Planner'!$T$8","v":0},56,null,{"$f":"K62+'Plot Planner'!$AB$8","v":0},56]
[null,{"$f":"B63+'Plot Planner'!$F$8","v":0},57,null,{"$f":"E63+'Plot Planner'!$M$8","v":0},57,null,{"$f":"H63+'Plot Planner'!$T$8","v":0},57,null,{"$f":"K63+'Plot Planner'!$AB$8","v":0},57]
[null,{"$f":"B64+'Plot Planner'!$F$8","v":0},58,null,{"$f":"E64+'Plot Planner'!$M$8","v":0},58,null,{"$f":"H64+'Plot Planner'!$T$8","v":0},58,null,{"$f":"K64+'Plot Planner'!$AB$8","v":0},58]
[null,{"$f":"B65+'Plot Planner'!$F$8","v":0},59,null,{"$f":"E65+'Plot Planner'!$M$8","v":0},59,null,{"$f":"H65+'Plot Planner'!$T$8","v":0},59,null,{"$f":"K65+'Plot Planner'!$AB$8","v":0},59]
[null,{"$f":"B66+'Plot Planner'!$F$8","v":0},60,null,{"$f":"E66+'Plot Planner'!$M$8","v":0},60,null,{"$f":"H66+'Plot Planner'!$T$8","v":0},60,null,{"$f":"K66+'Plot Planner'!$AB$8","v":0},60]
[null,{"$f":"B67+'Plot Planner'!$F$8","v":0},61,null,{"$f":"E67+'Plot Planner'!$M$8","v":0},61,null,{"$f":"H67+'Plot Planner'!$T$8","v":0},61,null,{"$f":"K67+'Plot Planner'!$AB$8","v":0},61]
[null,{"$f":"B68+'Plot Planner'!$F$8","v":0},62,null,{"$f":"E68+'Plot Planner'!$M$8","v":0},62,null,{"$f":"H68+'Plot Planner'!$T$8","v":0},62,null,{"$f":"K68+'Plot Planner'!$AB$8","v":0},62]
[null,{"$f":"B69+'Plot Planner'!$F$8","v":0},63,null,{"$f":"E69+'Plot Planner'!$M$8","v":0},63,null,{"$f":"H69+'Plot Planner'!$T$8","v":0},63,null,{"$f":"K69+'Plot Planner'!$AB$8","v":0},63]
[null,{"$f":"B70+'Plot Planner'!$F$8","v":0},64,null,{"$f":"E70+'Plot Planner'!$M$8","v":0},64,null,{"$f":"H70+'Plot Planner'!$T$8","v":0},64,null,{"$f":"K70+'Plot Planner'!$AB$8","v":0},64]
[null,{"$f":"B71+'Plot Planner'!$F$8","v":0},65,null,{"$f":"E71+'Plot Planner'!$M$8","v":0},65,null,{"$f":"H71+'Plot Planner'!$T$8","v":0},65,null,{"$f":"K71+'Plot Planner'!$AB$8","v":0},65]
[null,{"$f":"B72+'Plot Planner'!$F$8","v":0},66,null,{"$f":"E72+'Plot Planner'!$M$8","v":0},66,null,{"$f":"H72+'Plot Planner'!$T$8","v":0},66,null,{"$f":"K72+'Plot Planner'!$AB$8","v":0},66]
[null,{"$f":"B73+'Plot Planner'!$F$8","v":0},67,null,{"$f":"E73+'Plot Planner'!$M$8","v":0},67,null,{"$f":"H73+'Plot Planner'!$T$8","v":0},67,null,{"$f":"K73+'Plot Planner'!$AB$8","v":0},67]
[null,{"$f":"B74+'Plot Planner'!$F$8","v":0},68,null,{"$f":"E74+'Plot Planner'!$M$8","v":0},68,null,{"$f":"H74+'Plot Planner'!$T$8","v":0},68,null,{"$f":"K74+'Plot Planner'!$AB$8","v":0},68]
[null,{"$f":"B75+'Plot Planner'!$F$8","v":0},69,null,{"$f":"E75+'Plot Planner'!$M$8","v":0},69,null,{"$f":"H75+'Plot Planner'!$T$8","v":0},69,null,{"$f":"K75+'Plot Planner'!$AB$8","v":0},69]
[null,{"$f":"B76+'Plot Planner'!$F$8","v":0},70,null,{"$f":"E76+'Plot Planner'!$M$8","v":0},70,null,{"$f":"H76+'Plot Planner'!$T$8","v":0},70,null,{"$f":"K76+'Plot Planner'!$AB$8","v":0},70]
[null,{"$f":"B77+'Plot Planner'!$F$8","v":0},71,null,{"$f":"E77+'Plot Planner'!$M$8","v":0},71,null,{"$f":"H77+'Plot Planner'!$T$8","v":0},71,null,{"$f":"K77+'Plot Planner'!$AB$8","v":0},71]
[null,{"$f":"B78+'Plot Planner'!$F$8","v":0},72,null,{"$f":"E78+'Plot Planner'!$M$8","v":0},72,null,{"$f":"H78+'Plot Planner'!$T$8","v":0},72,null,{"$f":"K78+'Plot Planner'!$AB$8","v":0},72]
[null,{"$f":"B79+'Plot Planner'!$F$8","v":0},73,null,{"$f":"E79+'Plot Planner'!$M$8","v":0},73,null,{"$f":"H79+'Plot Planner'!$T$8","v":0},73,null,{"$f":"K79+'Plot Planner'!$AB$8","v":0},73]
[null,{"$f":"B80+'Plot Planner'!$F$8","v":0},74,null,{"$f":"E80+'Plot Planner'!$M$8","v":0},74,null,{"$f":"H80+'Plot Planner'!$T$8","v":0},74,null,{"$f":"K80+'Plot Planner'!$AB$8","v":0},74]
[null,{"$f":"B81+'Plot Planner'!$F$8","v":0},75,null,{"$f":"E81+'Plot Planner'!$M$8","v":0},75,null,{"$f":"H81+'Plot Planner'!$T$8","v":0},75,null,{"$f":"K81+'Plot Planner'!$AB$8","v":0},75]
[null,{"$f":"B82+'Plot Planner'!$F$8","v":0},76,null,{"$f":"E82+'Plot Planner'!$M$8","v":0},76,null,{"$f":"H82+'Plot Planner'!$T$8","v":0},76,null,{"$f":"K82+'Plot Planner'!$AB$8","v":0},76]
[null,{"$f":"B83+'Plot Planner'!$F$8","v":0},77,null,{"$f":"E83+'Plot Planner'!$M$8","v":0},77,null,{"$f":"H83+'Plot Planner'!$T$8","v":0},77,null,{"$f":"K83+'Plot Planner'!$AB$8","v":0},77]
[null,{"$f":"B84+'Plot Planner'!$F$8","v":0},78,null,{"$f":"E84+'Plot Planner'!$M$8","v":0},78,null,{"$f":"H84+'Plot Planner'!$T$8","v":0},78,null,{"$f":"K84+'Plot Planner'!$AB$8","v":0},78]
[null,{"$f":"B85+'Plot Planner'!$F$8","v":0},79,null,{"$f":"E85+'Plot Planner'!$M$8","v":0},79,null,{"$f":"H85+'Plot Planner'!$T$8","v":0},79,null,{"$f":"K85+'Plot Planner'!$AB$8","v":0},79]
[null,{"$f":"B86+'Plot Planner'!$F$8","v":0},80,null,{"$f":"E86+'Plot Planner'!$M$8","v":0},80,null,{"$f":"H86+'Plot Planner'!$T$8","v":0},80,null,{"$f":"K86+'Plot Planner'!$AB$8","v":0},80]
[null,{"$f":"B87+'Plot Planner'!$F$8","v":0},81,null,{"$f":"E87+'Plot Planner'!$M$8","v":0},81,null,{"$f":"H87+'Plot Planner'!$T$8","v":0},81,null,{"$f":"K87+'Plot Planner'!$AB$8","v":0},81]
[null,{"$f":"B88+'Plot Planner'!$F$8","v":0},82,null,{"$f":"E88+'Plot Planner'!$M$8","v":0},82,null,{"$f":"H88+'Plot Planner'!$T$8","v":0},82,null,{"$f":"K88+'Plot Planner'!$AB$8","v":0},82]
[null,{"$f":"B89+'Plot Planner'!$F$8","v":0},83,null,{"$f":"E89+'Plot Planner'!$M$8","v":0},83,null,{"$f":"H89+'Plot Planner'!$T$8","v":0},83,null,{"$f":"K89+'Plot Planner'!$AB$8","v":0},83]
[null,{"$f":"B90+'Plot Planner'!$F$8","v":0},84,null,{"$f":"E90+'Plot Planner'!$M$8","v":0},84,null,{"$f":"H90+'Plot Planner'!$T$8","v":0},84,null,{"$f":"K90+'Plot Planner'!$AB$8","v":0},84]
[null,{"$f":"B91+'Plot Planner'!$F$8","v":0},85,null,{"$f":"E91+'Plot Planner'!$M$8","v":0},85,null,{"$f":"H91+'Plot Planner'!$T$8","v":0},85,null,{"$f":"K91+'Plot Planner'!$AB$8","v":0},85]
[null,{"$f":"B92+'Plot Planner'!$F$8","v":0},86,null,{"$f":"E92+'Plot Planner'!$M$8","v":0},86,null,{"$f":"H92+'Plot Planner'!$T$8","v":0},86,null,{"$f":"K92+'Plot Planner'!$AB$8","v":0},86]
[null,{"$f":"B93+'Plot Planner'!$F$8","v":0},87,null,{"$f":"E93+'Plot Planner'!$M$8","v":0},87,null,{"$f":"H93+'Plot Planner'!$T$8","v":0},87,null,{"$f":"K93+'Plot Planner'!$AB$8","v":0},87]
[null,{"$f":"B94+'Plot Planner'!$F$8","v":0},88,null,{"$f":"E94+'Plot Planner'!$M$8","v":0},88,null,{"$f":"H94+'Plot Planner'!$T$8","v":0},88,null,{"$f":"K94+'Plot Planner'!$AB$8","v":0},88]
[null,{"$f":"B95+'Plot Planner'!$F$8","v":0},89,null,{"$f":"E95+'Plot Planner'!$M$8","v":0},89,null,{"$f":"H95+'Plot Planner'!$T$8","v":0},89,null,{"$f":"K95+'Plot Planner'!$AB$8","v":0},89]
[null,{"$f":"B96+'Plot Planner'!$F$8","v":0},90,null,{"$f":"E96+'Plot Planner'!$M$8","v":0},90,null,{"$f":"H96+'Plot Planner'!$T$8","v":0},90,null,{"$f":"K96+'Plot Planner'!$AB$8","v":0},90]
[null,{"$f":"B97+'Plot Planner'!$F$8","v":0},91,null,{"$f":"E97+'Plot Planner'!$M$8","v":0},91,null,{"$f":"H97+'Plot Planner'!$T$8","v":0},91,null,{"$f":"K97+'Plot Planner'!$AB$8","v":0},91]
[null,{"$f":"B98+'Plot Planner'!$F$8","v":0},92,null,{"$f":"E98+'Plot Planner'!$M$8","v":0},92,null,{"$f":"H98+'Plot Planner'!$T$8","v":0},92,null,{"$f":"K98+'Plot Planner'!$AB$8","v":0},92]
[null,{"$f":"B99+'Plot Planner'!$F$8","v":0},93,null,{"$f":"E99+'Plot Planner'!$M$8","v":0},93,null,{"$f":"H99+'Plot Planner'!$T$8","v":0},93,null,{"$f":"K99+'Plot Planner'!$AB$8","v":0},93]
[null,{"$f":"B100+'Plot Planner'!$F$8","v":0},94,null,{"$f":"E100+'Plot Planner'!$M$8","v":0},94,null,{"$f":"H100+'Plot Planner'!$T$8","v":0},94,null,{"$f":"K100+'Plot Planner'!$AB$8","v":0},94]
[null,{"$f":"B101+'Plot Planner'!$F$8","v":0},95,null,{"$f":"E101+'Plot Planner'!$M$8","v":0},95,null,{"$f":"H101+'Plot Planner'!$T$8","v":0},95,null,{"$f":"K101+'Plot Planner'!$AB$8","v":0},95]
[null,{"$f":"B102+'Plot Planner'!$F$8","v":0},96,null,{"$f":"E102+'Plot Planner'!$M$8","v":0},96,null,{"$f":"H102+'Plot Planner'!$T$8","v":0},96,null,{"$f":"K102+'Plot Planner'!$AB$8","v":0},96]
[null,{"$f":"B103+'Plot Planner'!$F$8","v":0},97,null,{"$f":"E103+'Plot Planner'!$M$8","v":0},97,null,{"$f":"H103+'Plot Planner'!$T$8","v":0},97,null,{"$f":"K103+'Plot Planner'!$AB$8","v":0},97]
[null,{"$f":"B104+'Plot Planner'!$F$8","v":0},98,null,{"$f":"E104+'Plot Planner'!$M$8","v":0},98,null,{"$f":"H104+'Plot Planner'!$T$8","v":0},98,null,{"$f":"K104+'Plot Planner'!$AB$8","v":0},98]
[null,{"$f":"B105+'Plot Planner'!$F$8","v":0},99,null,{"$f":"E105+'Plot Planner'!$M$8","v":0},99,null,{"$f":"H105+'Plot Planner'!$T$8","v":0},99,null,{"$f":"K105+'Plot Planner'!$AB$8","v":0},99]
[null,{"$f":"B106+'Plot Planner'!$F$8","v":0},100,null,{"$f":"E106+'Plot Planner'!$M$8","v":0},100,null,{"$f":"H106+'Plot Planner'!$T$8","v":0},100,null,{"$f":"K106+'Plot Planner'!$AB$8","v":0},100]
[null,{"$f":"B107+'Plot Planner'!$F$8","v":0},101,null,{"$f":"E107+'Plot Planner'!$M$8","v":0},101,null,{"$f":"H107+'Plot Planner'!$T$8","v":0},101,null,{"$f":"K107+'Plot Planner'!$AB$8","v":0},101]
[null,{"$f":"B108+'Plot Planner'!$F$8","v":0},102,null,{"$f":"E108+'Plot Planner'!$M$8","v":0},102,null,{"$f":"H108+'Plot Planner'!$T$8","v":0},102,null,{"$f":"K108+'Plot Planner'!$AB$8","v":0},102]
[null,{"$f":"B109+'Plot Planner'!$F$8","v":0},103,null,{"$f":"E109+'Plot Planner'!$M$8","v":0},103,null,{"$f":"H109+'Plot Planner'!$T$8","v":0},103,null,{"$f":"K109+'Plot Planner'!$AB$8","v":0},103]
[null,{"$f":"B110+'Plot Planner'!$F$8","v":0},104,null,{"$f":"E110+'Plot Planner'!$M$8","v":0},104,null,{"$f":"H110+'Plot Planner'!$T$8","v":0},104,null,{"$f":"K110+'Plot Planner'!$AB$8","v":0},104]
[null,{"$f":"B111+'Plot Planner'!$F$8","v":0},105,null,{"$f":"E111+'Plot Planner'!$M$8","v":0},105,null,{"$f":"H111+'Plot Planner'!$T$8","v":0},105,null,{"$f":"K111+'Plot Planner'!$AB$8","v":0},105]
[null,{"$f":"B112+'Plot Planner'!$F$8","v":0},106,null,{"$f":"E112+'Plot Planner'!$M$8","v":0},106,null,{"$f":"H112+'Plot Planner'!$T$8","v":0},106,null,{"$f":"K112+'Plot Planner'!$AB$8","v":0},106]
[null,{"$f":"B113+'Plot Planner'!$F$8","v":0},107,null,{"$f":"E113+'Plot Planner'!$M$8","v":0},107,null,{"$f":"H113+'Plot Planner'!$T$8","v":0},107,null,{"$f":"K113+'Plot Planner'!$AB$8","v":0},107]
[null,{"$f":"B114+'Plot Planner'!$F$8","v":0},108,null,{"$f":"E114+'Plot Planner'!$M$8","v":0},108,null,{"$f":"H114+'Plot Planner'!$T$8","v":0},108,null,{"$f":"K114+'Plot Planner'!$AB$8","v":0},108]
[null,{"$f":"B115+'Plot Planner'!$F$8","v":0},109,null,{"$f":"E115+'Plot Planner'!$M$8","v":0},109,null,{"$f":"H115+'Plot Planner'!$T$8","v":0},109,null,{"$f":"K115+'Plot Planner'!$AB$8","v":0},109]
[null,{"$f":"B116+'Plot Planner'!$F$8","v":0},110,null,{"$f":"E116+'Plot Planner'!$M$8","v":0},110,null,{"$f":"H116+'Plot Planner'!$T$8","v":0},110,null,{"$f":"K116+'Plot Planner'!$AB$8","v":0},110]
[null,{"$f":"B117+'Plot Planner'!$F$8","v":0},111,null,{"$f":"E117+'Plot Planner'!$M$8","v":0},111,null,{"$f":"H117+'Plot Planner'!$T$8","v":0},111,null,{"$f":"K117+'Plot Planner'!$AB$8","v":0},111]
[null,{"$f":"B118+'Plot Planner'!$F$8","v":0},112,null,{"$f":"E118+'Plot Planner'!$M$8","v":0},112,null,{"$f":"H118+'Plot Planner'!$T$8","v":0},112,null,{"$f":"K118+'Plot Planner'!$AB$8","v":0},112]
[null,{"$f":"B119+'Plot Planner'!$F$8","v":0},113,null,{"$f":"E119+'Plot Planner'!$M$8","v":0},113,null,{"$f":"H119+'Plot Planner'!$T$8","v":0},113,null,{"$f":"K119+'Plot Planner'!$AB$8","v":0},113]
[null,{"$f":"B120+'Plot Planner'!$F$8","v":0},114,null,{"$f":"E120+'Plot Planner'!$M$8","v":0},114,null,{"$f":"H120+'Plot Planner'!$T$8","v":0},114,null,{"$f":"K120+'Plot Planner'!$AB$8","v":0},114]
[null,{"$f":"B121+'Plot Planner'!$F$8","v":0},115,null,{"$f":"E121+'Plot Planner'!$M$8","v":0},115,null,{"$f":"H121+'Plot Planner'!$T$8","v":0},115,null,{"$f":"K121+'Plot Planner'!$AB$8","v":0},115]
[null,{"$f":"B122+'Plot Planner'!$F$8","v":0},116,null,{"$f":"E122+'Plot Planner'!$M$8","v":0},116,null,{"$f":"H122+'Plot Planner'!$T$8","v":0},116,null,{"$f":"K122+'Plot Planner'!$AB$8","v":0},116]
[null,{"$f":"B123+'Plot Planner'!$F$8","v":0},117,null,{"$f":"E123+'Plot Planner'!$M$8","v":0},117,null,{"$f":"H123+'Plot Planner'!$T$8","v":0},117,null,{"$f":"K123+'Plot Planner'!$AB$8","v":0},117]
[null,{"$f":"B124+'Plot Planner'!$F$8","v":0},118,null,{"$f":"E124+'Plot Planner'!$M$8","v":0},118,null,{"$f":"H124+'Plot Planner'!$T$8","v":0},118,null,{"$f":"K124+'Plot Planner'!$AB$8","v":0},118]
[null,{"$f":"B125+'Plot Planner'!$F$8","v":0},119,null,{"$f":"E125+'Plot Planner'!$M$8","v":0},119,null,{"$f":"H125+'Plot Planner'!$T$8","v":0},119,null,{"$f":"K125+'Plot Planner'!$AB$8","v":0},119]
[null,{"$f":"B126+'Plot Planner'!$F$8","v":0},120,null,{"$f":"E126+'Plot Planner'!$M$8","v":0},120,null,{"$f":"H126+'Plot Planner'!$T$8","v":0},120,null,{"$f":"K126+'Plot Planner'!$AB$8","v":0},120]
[null,{"$f":"B127+'Plot Planner'!$F$8","v":0},121,null,{"$f":"E127+'Plot Planner'!$M$8","v":0},121,null,{"$f":"H127+'Plot Planner'!$T$8","v":0},121,null,{"$f":"K127+'Plot Planner'!$AB$8","v":0},121]
[null,{"$f":"B128+'Plot Planner'!$F$8","v":0},122,null,{"$f":"E128+'Plot Planner'!$M$8","v":0},122,null,{"$f":"H128+'Plot Planner'!$T$8","v":0},122,null,{"$f":"K128+'Plot Planner'!$AB$8","v":0},122]
[null,{"$f":"B129+'Plot Planner'!$F$8","v":0},123,null,{"$f":"E129+'Plot Planner'!$M$8","v":0},123,null,{"$f":"H129+'Plot Planner'!$T$8","v":0},123,null,{"$f":"K129+'Plot Planner'!$AB$8","v":0},123]
[null,{"$f":"B130+'Plot Planner'!$F$8","v":0},124,null,{"$f":"E130+'Plot Planner'!$M$8","v":0},124,null,{"$f":"H130+'Plot Planner'!$T$8","v":0},124,null,{"$f":"K130+'Plot Planner'!$AB$8","v":0},124]
[null,{"$f":"B131+'Plot Planner'!$F$8","v":0},125,null,{"$f":"E131+'Plot Planner'!$M$8","v":0},125,null,{"$f":"H131+'Plot Planner'!$T$8","v":0},125,null,{"$f":"K131+'Plot Planner'!$AB$8","v":0},125]
[null,{"$f":"B132+'Plot Planner'!$F$8","v":0},126,null,{"$f":"E132+'Plot Planner'!$M$8","v":0},126,null,{"$f":"H132+'Plot Planner'!$T$8","v":0},126,null,{"$f":"K132+'Plot Planner'!$AB$8","v":0},126]
[null,{"$f":"B133+'Plot Planner'!$F$8","v":0},127,null,{"$f":"E133+'Plot Planner'!$M$8","v":0},127,null,{"$f":"H133+'Plot Planner'!$T$8","v":0},127,null,{"$f":"K133+'Plot Planner'!$AB$8","v":0},127]
[null,{"$f":"B134+'Plot Planner'!$F$8","v":0},128,null,{"$f":"E134+'Plot Planner'!$M$8","v":0},128,null,{"$f":"H134+'Plot Planner'!$T$8","v":0},128,null,{"$f":"K134+'Plot Planner'!$AB$8","v":0},128]
[null,{"$f":"B135+'Plot Planner'!$F$8","v":0},129,null,{"$f":"E135+'Plot Planner'!$M$8","v":0},129,null,{"$f":"H135+'Plot Planner'!$T$8","v":0},129,null,{"$f":"K135+'Plot Planner'!$AB$8","v":0},129]
[null,{"$f":"B136+'Plot Planner'!$F$8","v":0},130,null,{"$f":"E136+'Plot Planner'!$M$8","v":0},130,null,{"$f":"H136+'Plot Planner'!$T$8","v":0},130,null,{"$f":"K136+'Plot Planner'!$AB$8","v":0},130]
[null,{"$f":"B137+'Plot Planner'!$F$8","v":0},131,null,{"$f":"E137+'Plot Planner'!$M$8","v":0},131,null,{"$f":"H137+'Plot Planner'!$T$8","v":0},131,null,{"$f":"K137+'Plot Planner'!$AB$8","v":0},131]
[null,{"$f":"B138+'Plot Planner'!$F$8","v":0},132,null,{"$f":"E138+'Plot Planner'!$M$8","v":0},132,null,{"$f":"H138+'Plot Planner'!$T$8","v":0},132,null,{"$f":"K138+'Plot Planner'!$AB$8","v":0},132]
[null,{"$f":"B139+'Plot Planner'!$F$8","v":0},133,null,{"$f":"E139+'Plot Planner'!$M$8","v":0},133,null,{"$f":"H139+'Plot Planner'!$T$8","v":0},133,null,{"$f":"K139+'Plot Planner'!$AB$8","v":0},133]
[null,{"$f":"B140+'Plot Planner'!$F$8","v":0},134,null,{"$f":"E140+'Plot Planner'!$M$8","v":0},134,null,{"$f":"H140+'Plot Planner'!$T$8","v":0},134,null,{"$f":"K140+'Plot Planner'!$AB$8","v":0},134]
[null,{"$f":"B141+'Plot Planner'!$F$8","v":0},135,null,{"$f":"E141+'Plot Planner'!$M$8","v":0},135,null,{"$f":"H141+'Plot Planner'!$T$8","v":0},135,null,{"$f":"K141+'Plot Planner'!$AB$8","v":0},135]
[null,{"$f":"B142+'Plot Planner'!$F$8","v":0},136,null,{"$f":"E142+'Plot Planner'!$M$8","v":0},136,null,{"$f":"H142+'Plot Planner'!$T$8","v":0},136,null,{"$f":"K142+'Plot Planner'!$AB$8","v":0},136]
[null,{"$f":"B143+'Plot Planner'!$F$8","v":0},137,null,{"$f":"E143+'Plot Planner'!$M$8","v":0},137,null,{"$f":"H143+'Plot Planner'!$T$8","v":0},137,null,{"$f":"K143+'Plot Planner'!$AB$8","v":0},137]
[null,{"$f":"B144+'Plot Planner'!$F$8","v":0},138,null,{"$f":"E144+'Plot Planner'!$M$8","v":0},138,null,{"$f":"H144+'Plot Planner'!$T$8","v":0},138,null,{"$f":"K144+'Plot Planner'!$AB$8","v":0},138]
[null,{"$f":"B145+'Plot Planner'!$F$8","v":0},139,null,{"$f":"E145+'Plot Planner'!$M$8","v":0},139,null,{"$f":"H145+'Plot Planner'!$T$8","v":0},139,null,{"$f":"K145+'Plot Planner'!$AB$8","v":0},139]
[null,{"$f":"B146+'Plot Planner'!$F$8","v":0},140,null,{"$f":"E146+'Plot Planner'!$M$8","v":0},140,null,{"$f":"H146+'Plot Planner'!$T$8","v":0},140,null,{"$f":"K146+'Plot Planner'!$AB$8","v":0},140]
[null,{"$f":"B147+'Plot Planner'!$F$8","v":0},141,null,{"$f":"E147+'Plot Planner'!$M$8","v":0},141,null,{"$f":"H147+'Plot Planner'!$T$8","v":0},141,null,{"$f":"K147+'Plot Planner'!$AB$8","v":0},141]
[null,{"$f":"B148+'Plot Planner'!$F$8","v":0},142,null,{"$f":"E148+'Plot Planner'!$M$8","v":0},142,null,{"$f":"H148+'Plot Planner'!$T$8","v":0},142,null,{"$f":"K148+'Plot Planner'!$AB$8","v":0},142]
[null,{"$f":"B149+'Plot Planner'!$F$8","v":0},143,null,{"$f":"E149+'Plot Planner'!$M$8","v":0},143,null,{"$f":"H149+'Plot Planner'!$T$8","v":0},143,null,{"$f":"K149+'Plot Planner'!$AB$8","v":0},143]
[null,{"$f":"B150+'Plot Planner'!$F$8","v":0},144,null,{"$f":"E150+'Plot Planner'!$M$8","v":0},144,null,{"$f":"H150+'Plot Planner'!$T$8","v":0},144,null,{"$f":"K150+'Plot Planner'!$AB$8","v":0},144]
[null,{"$f":"B151+'Plot Planner'!$F$8","v":0},145,null,{"$f":"E151+'Plot Planner'!$M$8","v":0},145,null,{"$f":"H151+'Plot Planner'!$T$8","v":0},145,null,{"$f":"K151+'Plot Planner'!$AB$8","v":0},145]
[null,{"$f":"B152+'Plot Planner'!$F$8","v":0},146,null,{"$f":"E152+'Plot Planner'!$M$8","v":0},146,null,{"$f":"H152+'Plot Planner'!$T$8","v":0},146,null,{"$f":"K152+'Plot Planner'!$AB$8","v":0},146]
[null,{"$f":"B153+'Plot Planner'!$F$8","v":0},147,null,{"$f":"E153+'Plot Planner'!$M$8","v":0},147,null,{"$f":"H153+'Plot Planner'!$T$8","v":0},147,null,{"$f":"K153+'Plot Planner'!$AB$8","v":0},147]
[null,{"$f":"B154+'Plot Planner'!$F$8","v":0},148,null,{"$f":"E154+'Plot Planner'!$M$8","v":0},148,null,{"$f":"H154+'Plot Planner'!$T$8","v":0},148,null,{"$f":"K154+'Plot Planner'!$AB$8","v":0},148]
[null,{"$f":"B155+'Plot Planner'!$F$8","v":0},149,null,{"$f":"E155+'Plot Planner'!$M$8","v":0},149,null,{"$f":"H155+'Plot Planner'!$T$8","v":0},149,null,{"$f":"K155+'Plot Planner'!$AB$8","v":0},149]
[null,{"$f":"B156+'Plot Planner'!$F$8","v":0},150,null,{"$f":"E156+'Plot Planner'!$M$8","v":0},150,null,{"$f":"H156+'Plot Planner'!$T$8","v":0},150,null,{"$f":"K156+'Plot Planner'!$AB$8","v":0},150]