{"text_format":"1","workbook":"xlsx","n_sheets":8,"sheets":["Pre Con Checklist","Mid Con Checklist","As Built Checklist","Calculator","Checklist Guide","Pre Con Hot2000 Details","As Built Hot2000 Details","References"],"not_rendered":{"charts":0,"images":10,"macros":1,"external_links":3,"defined_names":57,"comments":4,"pivot_tables":0},"unopened":[],"bounds":{"document_bytes":16777216,"sheet_cells":100000,"rows_first":2000,"rows_last":500,"rows_between":2000,"halvings":0,"cell_chars":16384,"cell_head_chars":4096},"cells_cut":0,"cells_raw":0,"read":"whole","date_system":"1900"}

{"sheet":"Pre Con Checklist","index":0,"n_rows":202,"n_cols":12,"rows_kept":202,"cut":false,"hidden":false,"merged":[[81,3,81,9],[82,3,82,9],[84,0,86,2],[84,3,84,9],[188,6,188,8],[188,9,188,10],[158,7,158,11],[104,3,104,9],[183,9,183,10],[174,0,174,5],[175,0,175,5],[90,5,90,9],[93,3,93,9],[81,10,82,10],[96,0,97,2],[96,3,96,9],[97,3,97,9],[106,3,106,9],[155,0,155,11],[158,0,158,5],[107,3,107,9],[106,0,107,2],[65,10,65,11],[69,10,69,11],[71,10,71,11],[172,11,173,11],[94,3,94,9],[161,7,161,8],[161,9,161,11],[99,0,99,2],[66,10,66,11],[75,3,75,9],[85,3,85,9],[86,3,86,9],[89,3,89,9],[91,3,91,9],[99,3,99,9],[161,3,161,5],[172,10,173,10],[173,8,173,9],[101,3,101,11],[101,0,102,2],[88,3,88,4],[88,5,88,9],[90,3,90,4],[65,0,66,2],[51,0,54,2],[56,0,59,2],[48,0,48,11],[51,3,51,9],[52,3,52,9],[53,3,53,9],[54,3,54,9],[56,3,56,9],[57,3,57,9],[58,3,58,9],[59,3,59,9],[54,10,54,11],[53,10,53,11],[57,10,57,11],[56,10,56,11],[49,10,50,11],[37,0,37,11],[45,0,47,1],[39,0,39,2],[40,0,40,2],[41,0,41,2],[42,0,42,2],[43,0,43,2],[45,5,45,6],[42,3,42,7],[46,3,46,4],[43,3,43,7],[47,3,47,4],[47,5,47,6],[45,3,45,4],[41,8,41,9],[6,8,6,10],[5,8,5,10],[10,0,10,11],[13,0,13,6],[35,0,35,2],[32,0,32,8],[33,3,33,8],[34,3,34,8],[35,3,35,8],[34,0,34,2],[28,3,29,3],[27,4,29,4],[28,8,29,8],[27,9,29,9],[33,0,33,2],[8,7,8,9],[14,1,14,5],[61,3,61,9],[62,3,62,9],[102,3,102,11],[93,0,94,2],[1,4,1,8],[26,10,29,10],[39,10,39,11],[40,10,40,11],[41,10,41,11],[3,7,4,11],[3,3,3,6],[7,3,7,6],[40,8,40,9],[39,3,39,7],[40,3,40,7],[41,3,41,7],[39,8,39,9],[2,0,2,11],[3,0,3,2],[4,0,4,2],[5,0,5,2],[6,0,6,2],[7,0,7,2],[68,10,68,11],[4,3,4,6],[52,10,52,11],[5,3,5,6],[6,3,6,6],[51,10,51,11],[63,10,63,11],[7,8,7,10],[8,3,8,6],[46,5,46,6],[15,7,15,10],[16,7,18,10],[14,7,14,10],[21,7,23,10],[20,7,20,10],[15,1,15,5],[16,1,18,5],[20,1,20,5],[21,1,23,5],[61,10,61,11],[62,10,62,11],[58,10,58,11],[59,10,59,11],[61,0,63,2],[8,0,8,2],[201,0,201,9],[173,0,173,5],[185,3,185,4],[186,3,186,4],[188,3,188,4],[185,9,185,10],[190,0,190,11],[192,9,192,11],[201,10,201,11],[174,11,175,11],[176,11,177,11],[178,11,180,11],[186,9,186,10],[176,0,176,5],[177,0,177,5],[183,1,183,2],[196,0,197,1],[196,10,197,11],[198,0,200,1],[198,2,198,6],[198,10,200,11],[199,2,199,6],[200,2,200,6],[193,7,193,8],[66,3,66,9],[193,9,194,9],[193,10,194,11],[194,7,194,8],[178,0,178,5],[179,0,179,5],[164,3,164,4],[180,0,180,5],[181,0,181,5],[193,0,193,5],[72,10,72,11],[71,0,72,2],[75,0,79,2],[81,0,82,2],[72,3,72,9],[68,0,69,2],[76,3,76,9],[78,3,78,9],[77,3,77,9],[79,3,79,9],[71,3,71,9],[68,3,68,9],[69,3,69,9],[88,0,91,2],[74,10,74,11],[195,10,195,11],[183,3,183,5],[187,0,187,2],[187,3,187,4],[42,8,42,10],[169,7,169,10],[168,0,168,11],[159,0,159,2],[160,0,160,2],[161,0,161,2],[169,0,169,5],[172,0,172,6],[172,8,172,9],[171,10,171,11],[160,9,160,11],[160,3,160,5],[160,7,160,8],[159,9,159,11],[159,3,159,5],[159,7,159,8],[164,5,164,6],[63,3,63,9],[65,3,65,9]]}
[]
[null,null,null,null,"BC STEP CODE COMPLIANCE CHECKLIST - PERFORMANCE PATHS FOR PART 9 BUILDINGS"]
["A: PROJECT INFORMATION"]
["Building Permit #:",null,null,null,null,null,null,"Pre Construction"]
["Builder:"]
["Project Address:",null,null,null,null,null,null,null,"Building Type"]
["Municipality / District:",null,null,null,null,null,null,null,"Select One"]
["Postal Code:",null,null,null,null,null,null,"Other:"]
["PID or Legal Description:",null,null,null,null,null,null,"# of Dwelling Units:",null,null,{"$f":"Calculator!J31","v":0}]
[]
{"$rows_left_out":193}
{"sheet":"Mid Con Checklist","index":1,"n_rows":214,"n_cols":12,"rows_kept":214,"cut":false,"hidden":false,"merged":[[10,0,10,11],[107,0,107,11],[167,0,167,11],[127,0,127,11],[134,0,134,11],[135,0,135,11],[136,0,136,11],[137,0,137,11],[138,0,138,11],[92,3,92,9],[93,3,93,9],[90,3,90,9],[115,7,115,8],[116,7,116,8],[126,0,126,11],[125,0,125,7],[109,0,109,5],[109,7,109,8],[115,9,115,11],[116,9,116,11],[114,9,114,11],[113,9,113,11],[112,9,112,11],[114,3,114,4],[96,3,96,9],[98,3,98,9],[211,2,211,6],[181,0,181,5],[181,7,181,10],[210,0,212,1],[142,0,142,11],[143,0,143,11],[144,0,144,11],[145,0,145,11],[157,0,157,11],[158,0,158,11],[170,7,170,11],[205,10,206,11],[206,7,206,8],[197,3,197,4],[210,10,212,11],[198,3,198,4],[176,2,176,3],[198,9,198,10],[183,10,183,11],[163,0,163,11],[164,0,164,11],[207,10,207,11],[186,11,187,11],[141,0,141,11],[123,0,123,10],[122,0,122,7],[116,3,116,4],[116,0,116,2],[112,7,112,8],[113,7,113,8],[114,7,114,8],[187,0,187,5],[186,0,186,5],[173,3,173,5],[161,0,161,11],[162,0,162,11],[173,7,173,8],[160,0,160,11],[173,9,173,11],[171,9,171,11],[159,0,159,11],[172,9,172,11],[171,7,171,8],[171,3,171,5],[165,0,165,11],[188,11,189,11],[190,11,192,11],[204,9,204,11],[205,7,205,8],[205,9,206,9],[195,0,195,2],[195,3,195,5],[195,9,195,10],[202,0,202,11],[191,0,191,5],[192,0,192,5],[188,0,188,5],[189,0,189,5],[196,0,197,2],[73,10,73,11],[74,3,74,9],[77,3,77,9],[80,3,80,9],[80,10,81,10],[84,3,84,9],[88,3,88,9],[121,0,121,11],[140,0,140,11],[129,0,129,11],[130,0,130,11],[131,0,131,11],[128,0,128,11],[132,0,132,11],[133,0,133,11],[139,0,139,11],[101,3,101,11],[89,0,90,2],[100,0,101,2],[87,5,87,9],[89,5,89,9],[100,3,100,11],[98,0,98,2],[95,3,95,9],[210,2,210,6],[208,0,209,1],[39,0,39,2],[56,3,56,9],[51,3,51,9],[45,7,45,8],[46,7,46,8],[47,7,47,8],[51,0,51,2],[52,0,54,2],[56,0,56,2],[41,8,41,9],[46,3,46,4],[46,5,46,6],[47,3,47,4],[47,5,47,6],[48,0,48,11],[41,3,41,7],[42,0,42,2],[42,3,42,7],[50,3,50,9],[41,0,41,2],[54,10,54,11],[41,10,41,11],[56,10,56,11],[57,10,57,11],[65,10,65,11],[66,10,66,11],[49,10,50,11],[51,10,51,11],[52,10,52,11],[45,0,47,1],[63,10,63,11],[59,10,59,11],[52,3,52,9],[54,3,54,9],[57,3,57,9],[57,0,59,2],[61,0,62,2],[63,0,63,2],[65,0,65,2],[66,0,66,2],[42,8,42,10],[213,10,213,11],[213,0,213,9],[146,0,146,11],[147,0,147,11],[148,0,148,11],[149,0,149,11],[150,0,150,11],[151,0,151,11],[152,0,152,11],[153,0,153,11],[154,0,154,11],[155,0,155,11],[212,2,212,6],[208,10,209,11],[184,8,184,9],[184,10,185,10],[184,11,185,11],[200,6,200,8],[200,9,200,10],[185,8,185,9],[200,3,200,4],[172,3,172,5],[197,9,197,10],[1,4,1,8],[2,0,2,11],[3,3,3,6],[4,3,4,6],[7,3,7,6],[3,7,4,11],[5,3,5,6],[8,7,8,9],[6,3,6,6],[7,8,7,10],[8,3,8,6],[5,8,5,10],[6,8,6,10],[13,0,13,6],[58,3,58,9],[45,3,45,4],[45,5,45,6],[27,3,28,3],[26,4,28,4],[25,10,28,10],[26,9,28,9],[27,8,28,8],[30,0,31,7],[32,0,32,8],[43,0,43,2],[32,9,32,11],[40,0,40,2],[33,9,33,11],[39,3,39,7],[40,3,40,7],[14,1,14,5],[14,7,14,10],[15,1,15,5],[16,1,18,5],[20,1,20,5],[21,1,23,5],[15,7,15,10],[16,7,18,10],[20,7,20,10],[21,7,23,10],[71,10,71,11],[72,10,72,11],[61,10,61,11],[39,10,39,11],[40,10,40,11],[39,8,39,9],[43,3,43,7],[68,3,68,9],[69,3,69,9],[40,8,40,9],[53,3,53,9],[59,3,59,9],[61,3,61,9],[62,3,62,9],[63,3,63,9],[65,3,65,9],[66,3,66,9],[68,10,68,11],[53,10,53,11],[58,10,58,11],[62,10,62,11],[68,0,68,2],[69,0,69,2],[71,0,71,2],[72,0,72,2],[76,0,78,2],[74,0,75,2],[80,0,80,2],[87,3,87,4],[89,3,89,4],[69,10,69,11],[72,3,72,9],[156,0,156,11],[71,3,71,9],[75,3,75,9],[176,4,176,5],[85,3,85,9],[76,3,76,9],[78,3,78,9],[81,3,81,9],[83,3,83,9],[119,0,119,11],[120,0,120,11],[81,0,81,2],[83,0,84,2],[85,0,85,2],[87,0,88,2],[92,0,92,2],[93,0,93,2],[114,0,114,2],[95,0,95,2],[96,0,96,2],[113,0,113,2],[116,5,116,6]]}
[]
[null,null,null,null,"BC STEP CODE COMPLIANCE CHECKLIST - PERFORMANCE PATHS FOR PART 9 BUILDINGS"]
["A: PROJECT INFORMATION"]
["Building Permit #:",null,null,null,null,null,null,"Mid Construction"]
["Builder:"]
["Project Address:",null,null,null,null,null,null,null,"Building Type"]
["Municipality / District:",null,null,null,null,null,null,null,"Select One"]
["Postal Code:",null,null,null,null,null,null,"Other:"]
["PID or Legal Description:",null,null,null,null,null,null,"# of Dwelling Units:",null,null,{"$f":"Calculator!J85","v":0}]
[]
{"$rows_left_out":205}
{"sheet":"As Built Checklist","index":2,"n_rows":194,"n_cols":12,"rows_kept":194,"cut":false,"hidden":false,"merged":[[15,1,15,5],[15,7,15,10],[10,0,10,11],[147,0,147,11],[160,0,160,11],[98,0,98,2],[95,0,96,2],[95,3,95,9],[98,3,98,9],[96,3,96,9],[74,0,78,2],[80,0,81,2],[80,10,81,10],[81,3,81,9],[83,0,85,2],[85,3,85,9],[87,0,90,2],[92,0,93,2],[92,3,92,9],[88,3,88,9],[90,3,90,9],[93,3,93,9],[84,3,84,9],[80,3,80,9],[83,3,83,9],[87,3,87,4],[87,5,87,9],[89,3,89,4],[89,5,89,9],[153,3,153,5],[169,0,169,5],[161,7,161,10],[161,0,161,5],[153,9,153,11],[156,4,156,5],[150,7,150,11],[151,7,151,8],[101,3,101,11],[100,0,101,2],[100,3,100,11],[193,10,193,11],[193,0,193,9],[177,3,177,4],[178,3,178,4],[180,3,180,4],[177,9,177,10],[178,9,178,10],[180,6,180,8],[180,9,180,10],[190,2,190,6],[187,10,187,11],[188,0,189,1],[190,0,192,1],[184,9,184,11],[185,7,185,8],[185,9,186,9],[185,10,186,11],[186,7,186,8],[39,10,39,11],[69,10,69,11],[68,3,68,9],[69,3,69,9],[71,3,71,9],[151,9,151,11],[152,9,152,11],[188,10,189,11],[190,10,192,11],[166,11,167,11],[168,11,169,11],[170,11,172,11],[166,0,166,5],[74,3,74,9],[75,3,75,9],[175,0,175,2],[175,3,175,5],[175,9,175,10],[153,7,153,8],[150,0,150,5],[151,3,151,5],[152,3,152,5],[156,2,156,3],[163,10,163,11],[40,10,40,11],[41,10,41,11],[61,10,61,11],[62,10,62,11],[63,10,63,11],[71,10,71,11],[54,10,54,11],[66,3,66,9],[78,3,78,9],[40,8,40,9],[43,3,43,7],[66,10,66,11],[73,10,73,11],[76,3,76,9],[77,3,77,9],[42,8,42,10],[1,4,1,8],[191,2,191,6],[192,2,192,6],[5,3,5,6],[6,3,6,6],[2,0,2,11],[3,3,3,6],[4,3,4,6],[7,3,7,6],[7,8,7,10],[40,3,40,7],[59,3,59,9],[32,0,32,8],[44,3,44,7],[48,0,48,11],[51,10,51,11],[52,10,52,11],[51,3,51,9],[52,3,52,9],[53,3,53,9],[54,3,54,9],[167,0,167,5],[168,0,168,5],[39,3,39,7],[3,7,4,11],[5,8,5,10],[6,8,6,10],[65,10,65,11],[17,7,19,10],[21,7,21,10],[22,7,24,10],[28,3,29,3],[27,4,29,4],[28,8,29,8],[27,9,29,9],[26,10,29,10],[56,10,56,11],[57,10,57,11],[58,10,58,11],[59,10,59,11],[61,3,61,9],[62,3,62,9],[63,3,63,9],[13,0,13,6],[49,10,50,11],[45,0,47,1],[39,0,39,2],[41,8,41,9],[8,3,8,6],[8,7,8,9],[56,3,56,9],[57,3,57,9],[58,3,58,9],[43,0,43,2],[44,0,44,2],[41,3,41,7],[42,3,42,7],[42,0,42,2],[16,1,16,5],[17,1,19,5],[21,1,21,5],[22,1,24,5],[16,7,16,10],[53,10,53,11],[40,0,40,2],[41,0,41,2],[37,0,37,2],[51,0,54,2],[56,0,59,2],[32,9,32,11],[33,9,33,11],[39,8,39,9],[171,0,171,5],[172,0,172,5],[65,0,66,2],[61,0,63,2],[68,0,69,2],[71,0,72,2],[72,3,72,9],[72,10,72,11],[45,3,45,4],[45,5,45,6],[45,7,45,8],[45,10,45,11],[46,3,46,4],[46,5,46,6],[46,7,46,8],[47,3,47,4],[47,5,47,6],[47,7,47,8],[65,3,65,9],[68,10,68,11],[164,8,164,9],[164,10,165,10],[164,11,165,11],[165,8,165,9]]}
[]
[null,null,null,null,"BC STEP CODE COMPLIANCE CHECKLIST - PERFORMANCE PATHS FOR PART 9 BUILDINGS"]
["A: PROJECT INFORMATION"]
["Building Permit #:",null,null,null,null,null,null,"As Built"]
["Builder:"]
["Project Address:",null,null,null,null,null,null,null,"Building Type"]
["Municipality / District:",null,null,null,null,null,null,null,"Select One"]
["Postal Code:",null,null,null,null,null,null,"Other:"]
["PID or Legal Description:",null,null,null,null,null,null,"# of Dwelling Units:",null,null,{"$f":"Calculator!J85","v":0}]
[]
{"$rows_left_out":185}
{"sheet":"Calculator","index":3,"n_rows":165,"n_cols":43,"rows_kept":165,"cut":false,"hidden":false,"merged":[[160,8,164,12],[159,8,159,12],[7,42,9,42],[5,38,5,42],[61,42,63,42],[59,38,59,42],[62,24,63,24],[62,26,63,26],[62,28,63,28],[62,30,63,30],[62,32,63,32],[5,23,5,37],[61,40,63,40],[61,41,63,41],[7,40,9,40],[7,41,9,41],[7,38,9,38],[8,32,9,32],[61,38,63,38],[61,39,63,39],[61,34,63,34],[8,30,9,30],[7,39,9,39],[59,23,59,37],[61,35,62,37],[7,35,8,37],[150,4,150,8],[150,16,151,16],[152,16,154,16],[7,29,7,30],[7,33,9,33],[7,34,9,34],[7,23,7,24],[7,25,7,26],[147,13,147,14],[119,4,119,5],[120,4,120,5],[121,4,124,5],[119,6,119,7],[123,6,123,7],[124,6,124,7],[136,4,136,8],[61,27,61,28],[61,29,61,30],[61,31,61,32],[61,33,63,33],[61,5,63,5],[136,16,137,16],[7,4,9,4],[61,4,63,4],[148,16,149,16],[2,14,2,19],[5,19,5,20],[7,19,9,19],[7,20,9,20],[7,17,9,17],[7,18,9,18],[7,10,9,10],[5,10,5,12],[7,11,9,11],[7,12,9,12],[30,4,30,5],[5,3,5,9],[7,5,9,5],[7,3,9,3],[6,6,6,8],[7,6,8,8],[7,9,9,9],[5,21,5,22],[146,16,147,16],[133,13,133,14],[146,13,146,14],[146,15,147,15],[132,13,132,14],[132,15,133,15],[145,15,145,16],[138,16,140,16],[59,19,59,20],[113,17,114,22],[137,22,137,26],[132,16,133,16],[134,16,135,16],[8,26,9,26],[7,13,9,13],[5,13,5,17],[154,19,154,26],[145,29,145,30],[146,27,146,28],[146,29,147,29],[146,30,147,30],[147,27,147,28],[132,30,133,30],[135,30,136,30],[137,30,139,30],[135,19,136,22],[149,19,150,22],[132,27,132,28],[151,30,153,30],[149,30,150,30],[140,19,140,26],[132,29,133,29],[133,27,133,28],[151,19,153,21],[153,22,153,26],[152,22,152,26],[151,22,151,26],[137,19,139,21],[139,22,139,26],[138,22,138,26],[7,31,7,32],[7,14,9,14],[7,21,9,21],[7,22,9,22],[7,27,7,28],[61,20,63,20],[61,21,63,21],[61,23,61,24],[61,25,61,26],[59,21,59,22],[8,23,9,23],[61,16,63,16],[61,17,63,17],[61,18,63,18],[61,19,63,19],[7,15,9,15],[7,16,9,16],[8,28,9,28],[8,25,9,25],[8,24,9,24],[131,29,131,30],[61,6,62,8],[59,10,59,12],[59,13,59,17],[114,11,115,15],[61,12,63,12],[61,13,63,13],[61,14,63,14],[61,15,63,15],[131,15,131,16],[62,23,63,23],[62,25,63,25],[61,10,63,10],[61,11,63,11],[127,4,127,16],[127,19,127,30],[116,4,118,5],[84,4,84,5],[59,3,59,9],[61,22,63,22],[120,6,120,7],[61,9,63,9],[116,11,118,13],[114,4,115,7]]}
["BC Energy and Carbon Step Code Compliance Calculator "]
[]
[]
[]
[null,null,null,"9.36 Step Code Data Proposed"]
[null,null,null,"The following columns are used to calculate:",null,null,null,null,null,null,"% Improvement & MEUI",null,null,"Whole Building ACH & NLA",null,null,null,null,"TEDI"," % Heat Loss Reduction",null,"% of Building Cooled",null,"GHG",null,null,null,null,null,null,null,null,null,null,null,null,null,null,"Energy Consumption"]
[]
[null,null,null,"Line #","Suite Number/ Name","P\nFile #'s:","Heated Floor Area (m2)",null,null,"Number Of Dwelling Units","Baseloads\n (GJ)","Total AEC\n (GJ)","ERS Reference\nHouse (GJ)","Building Envelope Surface Area\n(m2)","Building Volume (m3)","ACH\n@ 50Pa","Airtightness\nNLA @ 10 Pa (cm2/m2)","Airtightness NLR  (L/s/m2) @ 50Pa","Auxiliary Energy\nRequired (MJ)","PROPOSED\nGross Space Heat Loss (GJ)","REFERENCE\nGross Space Heat Loss (GJ)","Design Cooling Load (Watts)","Cooling System Capacity\n(Watts)","Electricity",null,"Natural Gas",null,"Propane",null,"District Energy",null,"Other GHG",null,"Total GHG (kg)","GHGI\n(kg CO2e /m²)","Fuel Type",null,null,"Electricity Consumption\n(GJ)","Natural Gas Consumption\n(GJ)","Propane Consumption\n(GJ)","District Energy Consumption \n(GJ)","Other (GJ)"]
[null,null,null,null,null,null,null,null,null,null,null,null,null,null,null,null,null,null,null,null,null,null,null,"EF\n(kg CO2e/GJ)","GHG (kg)","EF\n(kg CO2e/GJ)","GHG (kg)","EF \n(kg CO2e/GJ)","GHG (kg)","EF \n(kg CO2e/GJ)","GHG (kg)","EF\n(kg CO2e/GJ)","GHG (kg)"]
[null,null,null,null,null,null,"Above Grade","Below Grade","Total",null,null,null,null,null,null,null,null,null,null,null,null,null,null,null,null,null,null,null,null,null,null,null,null,null,null,"Heating","Hot Water","Other"]
{"$rows_left_out":156}
{"sheet":"Checklist Guide","index":4,"n_rows":268,"n_cols":14,"rows_kept":268,"cut":false,"hidden":false,"merged":[[22,12,24,12],[22,13,24,13],[13,12,13,13],[15,12,17,12],[15,13,17,13],[19,12,21,12],[19,13,21,13],[223,0,224,0],[223,1,224,1],[223,2,223,3],[224,2,224,3],[220,1,220,3],[176,2,176,3],[176,0,177,0],[180,0,182,0],[186,2,186,3],[193,2,193,3],[194,0,195,0],[196,2,196,3],[199,2,199,3],[194,2,194,3],[215,0,216,0],[217,0,218,0],[152,4,155,4],[231,0,232,0],[231,1,232,1],[232,2,232,3],[178,4,180,4],[183,0,185,0],[186,0,187,0],[199,4,200,4],[200,2,200,3],[219,1,219,3],[188,0,189,0],[192,0,193,0],[210,1,211,1],[212,0,214,0],[212,1,214,1],[214,2,214,3],[203,1,204,1],[205,0,207,0],[208,0,209,0],[195,2,195,3],[199,0,200,0],[199,1,200,1],[190,0,191,0],[208,2,208,3],[205,2,205,3],[264,1,264,3],[265,1,265,3],[245,2,245,3],[246,2,246,3],[239,2,239,3],[222,2,222,3],[237,1,237,3],[225,1,226,1],[225,2,225,3],[226,2,226,3],[227,1,228,1],[228,2,228,3],[248,2,248,3],[249,2,249,3],[250,2,250,3],[251,2,251,3],[252,2,252,3],[244,2,244,3],[253,2,253,3],[254,2,254,3],[229,1,230,1],[230,2,230,3],[233,0,234,0],[233,1,234,1],[229,2,229,3],[266,2,266,3],[267,2,267,3],[235,0,236,0],[235,1,236,1],[235,2,235,3],[236,2,236,3],[258,2,258,3],[259,2,259,3],[260,2,260,3],[238,1,238,3],[241,2,241,3],[242,2,242,3],[243,2,243,3],[247,2,247,3],[257,2,257,3],[229,0,230,0],[262,2,262,3],[263,2,263,3],[256,2,256,3],[261,2,261,3],[255,2,255,3],[2,9,2,10],[240,2,240,3],[146,0,147,0],[146,1,147,1],[146,2,146,3],[196,1,198,1],[194,1,195,1],[190,1,191,1],[192,1,193,1],[188,1,189,1],[186,1,187,1],[183,1,185,1],[221,0,222,0],[197,2,197,3],[221,1,222,1],[221,2,221,3],[203,2,203,3],[225,0,226,0],[227,0,228,0],[231,2,231,3],[168,4,169,4],[196,0,198,0],[198,2,198,3],[186,4,187,4],[133,1,134,1],[133,2,133,3],[134,2,134,3],[155,2,155,3],[142,1,142,3],[154,2,154,3],[154,1,155,1],[143,2,143,3],[145,2,145,3],[144,2,144,3],[150,1,151,1],[150,2,150,3],[162,0,169,0],[162,1,169,1],[169,2,169,3],[162,2,162,3],[163,2,163,3],[164,2,164,3],[165,2,165,3],[166,2,166,3],[168,2,168,3],[167,2,167,3],[127,2,127,3],[128,2,128,3],[156,0,157,0],[154,0,155,0],[148,0,149,0],[137,0,138,0],[137,1,138,1],[137,2,137,3],[127,0,128,0],[127,1,128,1],[141,1,141,3],[136,2,136,3],[131,1,132,1],[148,1,149,1],[132,2,132,3],[148,2,148,3],[149,2,149,3],[131,2,131,3],[138,2,138,3],[129,0,130,0],[129,1,130,1],[129,2,129,3],[130,2,130,3],[133,0,134,0],[135,0,136,0],[135,1,136,1],[135,2,135,3],[131,0,132,0],[48,0,49,0],[48,1,49,1],[48,2,48,3],[49,2,49,3],[50,0,51,0],[78,0,79,0],[78,1,79,1],[86,1,87,1],[86,2,86,3],[87,2,87,3],[81,1,81,3],[60,1,60,3],[66,2,66,3],[67,2,67,3],[72,0,73,0],[105,0,106,0],[105,1,106,1],[92,2,92,3],[93,2,93,3],[88,0,89,0],[44,1,45,1],[44,2,44,3],[54,0,55,0],[68,0,69,0],[68,1,69,1],[68,2,68,3],[69,2,69,3],[56,0,57,0],[56,1,57,1],[58,0,59,0],[58,1,59,1],[62,0,63,0],[62,1,63,1],[64,0,65,0],[64,2,64,3],[65,2,65,3],[46,1,47,1],[46,2,46,3],[47,2,47,3],[45,2,45,3],[52,0,53,0],[53,2,53,3],[62,2,62,3],[101,0,102,0],[101,1,102,1],[101,2,101,3],[102,2,102,3],[103,0,104,0],[103,1,104,1],[103,2,103,3],[104,2,104,3],[94,0,100,0],[94,2,94,3],[95,2,95,3],[94,1,100,1],[34,0,37,0],[39,2,39,3],[35,2,35,3],[36,2,36,3],[34,1,37,1],[40,0,41,0],[40,1,41,1],[40,2,40,3],[41,2,41,3],[34,2,34,3],[28,0,29,0],[28,1,29,1],[28,2,28,3],[29,2,29,3],[30,1,31,1],[30,2,30,3],[31,2,31,3],[20,2,20,3],[21,2,21,3],[121,0,126,0],[112,2,112,3],[107,0,109,0],[116,0,118,0],[114,0,115,0],[114,1,115,1],[114,2,114,3],[111,2,111,3],[124,2,124,3],[125,1,126,1],[123,1,124,1],[123,2,123,3],[125,2,125,3],[108,2,108,3],[118,2,118,3],[116,2,116,3],[107,2,107,3],[2,6,2,7],[14,1,14,3],[16,1,17,1],[16,2,16,3],[17,2,17,3],[18,1,19,1],[18,2,18,3],[19,2,19,3],[15,1,15,3],[16,4,27,4],[22,2,22,3],[23,2,23,3],[26,2,26,3],[27,2,27,3],[20,1,21,1],[26,1,27,1],[2,1,2,2],[3,1,3,2],[8,1,8,2],[13,2,13,3],[24,1,25,1],[22,1,23,1],[10,1,10,3],[88,2,88,3],[89,2,89,3],[90,1,91,1],[58,2,58,3],[59,2,59,3],[86,0,87,0],[42,0,43,0],[42,1,43,1],[42,2,42,3],[43,2,43,3],[70,0,71,0],[70,1,71,1],[70,2,70,3],[82,0,83,0],[90,0,91,0],[46,0,47,0],[82,1,83,1],[82,2,82,3],[83,2,83,3],[75,2,75,3],[76,0,77,0],[76,1,77,1],[74,1,75,1],[44,0,45,0],[92,0,93,0],[92,1,93,1],[18,0,19,0],[32,1,32,3],[38,2,38,3],[38,1,39,1],[38,0,39,0],[73,2,73,3],[84,0,85,0],[84,1,85,1],[84,2,84,3],[85,2,85,3],[54,1,55,1],[52,1,53,1],[52,2,52,3],[51,2,51,3],[72,1,73,1],[72,2,72,3],[20,0,21,0],[22,0,23,0],[24,0,25,0],[26,0,27,0],[63,2,63,3],[88,1,89,1],[157,2,157,3],[190,2,190,3],[191,2,191,3],[189,2,189,3],[147,2,147,3],[174,1,174,3],[204,2,204,3],[201,2,201,3],[202,2,202,3],[201,1,202,1],[151,2,151,3],[206,2,206,3],[205,1,207,1],[234,2,234,3],[183,2,183,3],[233,2,233,3],[227,2,227,3],[171,2,171,3],[185,2,185,3],[181,2,181,3],[217,1,218,1],[217,2,217,3],[218,2,218,3],[208,1,209,1],[209,2,209,3],[215,1,216,1],[215,2,215,3],[211,2,211,3],[210,2,210,3],[212,2,212,3],[213,2,213,3],[187,2,187,3],[105,2,105,3],[90,2,90,3],[91,2,91,3],[66,0,67,0],[66,1,67,1],[121,1,122,1],[110,1,111,1],[110,2,110,3],[117,2,117,3],[112,0,113,0],[112,1,113,1],[110,0,111,0],[119,0,120,0],[119,1,120,1],[115,2,115,3],[119,2,119,3],[120,2,120,3],[113,2,113,3],[116,1,118,1],[109,2,109,3],[106,2,106,3],[74,0,75,0],[76,2,76,3],[77,2,77,3],[213,4,216,4],[216,2,216,3],[158,0,159,0],[172,0,173,0],[201,0,202,0],[203,0,204,0],[178,0,179,0],[178,1,179,1],[178,2,178,3],[179,2,179,3],[210,4,212,4],[158,1,159,1],[158,2,158,3],[159,2,159,3],[172,1,173,1],[172,2,172,3],[160,4,166,4],[173,2,173,3],[175,1,175,3],[176,1,177,1],[184,2,184,3],[160,1,161,1],[160,2,160,3],[170,1,171,1],[210,0,211,0],[207,2,207,3],[192,2,192,3],[188,2,188,3],[150,0,151,0],[121,2,121,3],[122,2,122,3],[126,2,126,3],[139,0,140,0],[139,1,140,1],[139,2,139,3],[140,2,140,3],[180,2,180,3],[182,2,182,3],[177,2,177,3],[156,2,156,3],[156,1,157,1],[153,1,153,3],[152,1,152,3],[170,2,170,3],[161,2,161,3],[180,1,182,1],[160,0,161,0],[170,0,171,0],[16,0,17,0],[30,0,31,0],[96,2,96,3],[97,2,97,3],[99,2,99,3],[83,4,109,4],[46,4,47,4],[54,2,54,3],[78,2,78,3],[79,2,79,3],[63,4,75,4],[56,2,56,3],[57,2,57,3],[61,1,61,3],[107,1,109,1],[98,2,98,3],[100,2,100,3],[80,1,80,3],[64,1,65,1],[71,2,71,3],[50,1,51,1],[50,2,50,3],[55,2,55,3],[74,2,74,3],[15,10,17,10],[15,9,17,9],[19,10,21,10],[19,9,21,9],[13,6,13,7],[13,9,13,10],[24,2,24,3],[25,2,25,3],[37,2,37,3],[33,1,33,3]]}
[null,"Checklist and Variables Guide "]
[null,"Pre-Construction Checklist"]
[null,"Data requiring manual entry in the Pre-Construction Checklist has light-yellow fields."]
[null,"Light yellow fields in the Pre-Construction checklist typically auto-populate to the As-Built checklist;"]
[null,"Example:"]
[null,"Requires data","No Data entry (Data Auto-populates)"]
[]
[null,"As Built Checklist"]
[null,"Data can be overwritten by Energy Advisors in the case of changes."]
[]
{"$rows_left_out":259}
{"sheet":"Pre Con Hot2000 Details","index":5,"n_rows":1,"n_cols":2,"rows_kept":1,"cut":false,"hidden":true,"merged":[[0,1,0,12]]}
[null,"Pre Construction Hot2000 Model Details"]

{"sheet":"As Built Hot2000 Details","index":6,"n_rows":1,"n_cols":2,"rows_kept":1,"cut":false,"hidden":true,"merged":[[0,1,0,12]]}
[null,"As Built Hot2000 Model Details"]

{"sheet":"References","index":7,"n_rows":298,"n_cols":40,"rows_kept":298,"cut":false,"hidden":true,"merged":[[107,1,107,7],[115,1,115,7],[99,1,99,7],[93,1,93,3],[82,1,82,8],[87,1,87,4],[50,1,50,9],[39,33,39,35],[39,37,39,39],[3,8,4,19],[6,11,6,13],[6,16,7,16],[7,14,7,15],[7,19,7,20],[23,22,24,24],[6,17,6,18],[6,10,7,10],[6,9,7,9],[6,8,7,8]]}
[]
[null,"Step Code Reference Charts"]
[]
[null,"Update the individual tables below when needed",null,null,null,null,null,null,"This table's Adjusted TEDI depends on the HDD entered in the \"SFH & MURB Calcualtor\" & \"Attached Non-MURB Calculator\" Tabs. The Formulas used to calculate the TEDI targets based on HDDS can be found in section 9.36.6.3 of the BCBC Revision 2 Amendments ",null,null,null,null,null,null,null,null,null,null,null,null,null,null,null,null,null,"Reference Table, do not modify!"]
[null,"See Article 9.36.6.3. Complaine Requirements of Division B",null,null,null,null,null,null,null,null,null,null,null,null,null,null,null,null,null,null,null,null,null,null,null,null,null,null,null,null,null,null,null,"Carbon Standard Refernce Tables"]
[null,null,null,null,null,null,null,null,1,{"$f":"I6+1","v":2},3,4,5,6,7,8,9,10,11,12,13,null,"Dropdown menu 1",null,null,null,1,2,3,4,5,6]
[null,"Floor Area of Conditioned Space (m2)",null,null,null,null,null,null,"Helper","Step Level","Climate Zone","Airtightness",null,null,"Over 300m3","Under 300m3","TEDI","HDD Adjusted TEDI",null,"Over 300m3","Under 300m3"]
[null,{"$f":"IF(Calculator!I31<50.5,\"≤ 50\",(IF((AND(Calculator!I31>=50.5,Calculator!I31<75.5)),\"51 to 75\",(IF((AND(Calculator!I31>=75.5,Calculator!I31<120.5)),\"76 to 120\",(IF((AND(Calculator!I31>=120.5,Calculator!I31<165.5)),\"121 to 165\",(IF((AND(Calculator!I31>=165.5,Calculator!I31<210.5)),\"166 to 210\",(IF(Calculator!I31>=210.5,\"> 210\",1)))))))))))","v":"≤ 50"},{"$f":"IF(Calculator!I85<50.5,\"≤ 50\",(IF((AND(Calculator!I85>=50.5,Calculator!I85<75.5)),\"51 to 75\",(IF((AND(Calculator!I85>=75.5,Calculator!I85<120.5)),\"76 to 120\",(IF((AND(Calculator!I85>=120.5,Calculator!I85<165.5)),\"121 to 165\",(IF((AND(Calculator!I85>=165.5,Calculator!I85<210.5)),\"166 to 210\",(IF(Calculator!I85>=210.5,\"> 210\",1)))))))))))","v":"≤ 50"},null,null,null,null,null,null,null,null,"ACH","NLA","NLR","% LTRH",null,null,"SFH &\nMURB\nCalculator",null,"Grose Space HL",null,null,"Step Level",null,null,null,"Helper","Heating Degree-Days of Building Location in Celsius Degree-Days","Amount of the Building’s Conditioned Space Served by\nSpace-Cooling\nEquipment","Step","Floor Area of Conditioned Space (m2)","Mechanical Energy Use Intensity, kWh/(m2•year)"]
[null,null,null,null,null,null,null,null,null,null,null,null,null,null,null,null,null,null,null,null,null,null,null,null,null,null,{"$f":"AB9 & AC9 & AD9 & AE9","v":"4 - Less than 3000Not more than 50%2≤ 50"},"4 - Less than 3000","Not more than 50%",2,"≤ 50",135,null,"Total Carbon"]
[null,"Fuel Conversion Factors",null,null,"/ GJ",null,null,null,null,null,null,null,null,null,null,null,null,null,null,null,null,null,null,null,null,null,{"$f":"AB10 & AC10 & AD10 & AE10","v":"4 - Less than 3000Not more than 50%251 to 75"},"4 - Less than 3000","Not more than 50%",2,"51 to 75",120,null,1,2]
{"$rows_left_out":288}