{"text_format":"1","workbook":"xlsx","n_sheets":24,"sheets":["Key Features","Cover","Data","Variables","Verification","TOC","Management Report","Statement 1","Statement 2","Statement 3","Statement 4","Statement 5","Schedule 1","Schedule 2","Schedule 2A","Schedule 2B","Schedule 2C","Schedule 3","Schedule 3A","Schedule 4","Schedule 4A","Schedule 4B","Schedule 4C","Schedule 4D"],"not_rendered":{"charts":0,"images":56,"macros":1,"external_links":0,"defined_names":30,"comments":4,"pivot_tables":0},"unopened":[],"bounds":{"document_bytes":16777216,"sheet_cells":100000,"rows_first":2000,"rows_last":500,"rows_between":2000,"halvings":0,"cell_chars":16384,"cell_head_chars":4096},"cells_cut":0,"cells_raw":0,"read":"whole","date_system":"1900"}

{"sheet":"Key Features","index":0,"n_rows":88,"n_cols":2,"rows_kept":88,"cut":false,"hidden":false,"merged":[[0,0,0,10],[1,0,1,10],[8,1,8,6]]}
[{"$f":"\"Welcome to the \" & Variables!A2 & \" Financial Statement Excel package.\"","v":"Welcome to the 2023/2024 Financial Statement Excel package."}]
[]
["System Requirements:"]
["- At this time, Excel for Mac is NOT supported."]
["Key Features:"]
[]
["1.)  Macros MUST be enabled and saved in .xlsm format"]
[null,"Note:  If document is saved in the .xlsx format, it is no longer functional and cannot be converted back"]
{"$rows_left_out":81}
{"sheet":"Cover","index":1,"n_rows":19,"n_cols":15,"rows_kept":19,"cut":false,"hidden":false,"merged":[[17,16,17,23],[17,10,17,15],[0,14,1,15],[14,10,14,15],[6,10,6,11],[7,10,7,11],[6,12,6,14],[7,12,7,14]]}
[null,null,null,null,null,null,null,null,null,null,null,null,null,null,"v12.1 June 2024"]
[]
[]
[]
[]
[]
[null,null,null,null,null,null,null,null,null,null,{"$f":"IF(Variables!P7=\"\",\"\",\"Package Finalized\")","v":""},null,{"$f":"IF(Variables!P7=\"\",\"\",\"- \"&Variables!P13)","v":""}]
[null,null,null,null,null,null,null,null,null,null,{"$f":"IF(Variables!P7=\"\",\"\",\"Version:\")","v":""},null,{"$f":"IF(Variables!P7=\"\",\"\",Variables!P7)","v":""}]
{"$rows_left_out":12}
{"sheet":"Data","index":2,"n_rows":3880,"n_cols":7,"rows_kept":3880,"cut":false,"hidden":true,"merged":[]}
[]
["Page","Column","Category","Heading","Sub-Heading","Sub-Sub-Heading",{"$f":"Variables!P2","v":""}]
["Variables","Package",null,null,null,null,"Financial Statement"]
["Variables","Year",null,null,null,null,{"$f":"Variables!A2","v":"2023/2024"}]
["Variables","Version Number",null,null,null,null,{"$f":"Variables!P7","v":0}]
["Variables","Person to Finalize",null,null,null,null,{"$f":"Variables!P10","v":0}]
["Variables","Time Stamp",null,null,null,null,{"$f":"Variables!P13","v":0}]
["Cover","External Auditor",null,null,null,null,{"$f":"Cover!Q18","v":0}]
{"$rows_left_out":3873}
{"sheet":"Variables","index":3,"n_rows":61,"n_cols":23,"rows_kept":61,"cut":false,"hidden":true,"merged":[[0,14,0,15]]}
["Program Year",null,null,null,null,null,null,null,null,1,null,"SD","Name",null,"Choice",null,null,"Username","Date & Time","Old Version #","Old Username","Old Finalize Date","Reason"]
[{"$f":"(RIGHT(Cover!B19,4)-1) & \"/\" & RIGHT(Cover!B19,4)","v":"2023/2024"},{"$f":"LEFT(A2,4)","v":"2023"},{"$f":"RIGHT(A2,4)","v":"2024"},null,null,null,null,null,null,2,"5 (Southeast Kootenay)",{"$f":"LEFT(K2,1)","v":"5"},{"$f":"MID(K2,4,(LEN(K2)-4))","v":"Southeast Kootenay"},null,{"$f":"IF(P2 = \"\",\"\",VLOOKUP(P2,SD_lookup,2,FALSE) )","v":""},""]
[null,null,null,null,null,null,null,null,null,3,"6 (Rocky Mountain)",{"$f":"LEFT(K3,1)","v":"6"},{"$f":"MID(K3,4,(LEN(K3)-4))","v":"Rocky Mountain"}]
["Days/Months of the Year",null,null,null,null,null,null,null,null,4,"8 (Kootenay Lake)",{"$f":"LEFT(K4,1)","v":"8"},{"$f":"MID(K4,4,(LEN(K4)-4))","v":"Kootenay Lake"}]
["- Month -","- Day -",null,null,null,null,null,null,null,5,"10 (Arrow Lakes)",{"$f":"LEFT(K5,2)","v":"10"},{"$f":"MID(K5,5,(LEN(K5)-5))","v":"Arrow Lakes"},null,null,"Current"]
["January","1st",null,null,null,null,null,null,null,6,"19 (Revelstoke)","19","Revelstoke",null,null,"Version #"]
["February","2nd",null,null,null,null,null,null,null,7,"20 (Kootenay-Columbia)","20","Kootenay-Columbia"]
["March","3rd",null,null,null,null,null,null,null,8,"22 (Vernon)","22","Vernon"]
{"$rows_left_out":54}
{"sheet":"Verification","index":4,"n_rows":179,"n_cols":4,"rows_kept":179,"cut":false,"hidden":false,"merged":[[0,0,0,1],[1,0,1,1],[2,0,2,1],[3,0,3,1],[112,6,112,8],[96,6,96,8],[46,6,46,8],[47,6,47,8],[97,6,97,8]]}
[{"$f":"\"Total Number of Rules Applicable to the \" & Variables!A2 & \" Financial Statements: \"& COUNTA(A7:A179)","v":"Total Number of Rules Applicable to the 2023/2024 Financial Statements: 173"},null,null,{"$f":"Cover!B15","v":"School District No. "}]
[{"$f":"\"Rules with Passed Status: \"&COUNTIF(C7:C179,\"Passed\")","v":"Rules with Passed Status: 172"},null,null,{"$f":"Variables!A2 & \" Financial Statements\"","v":"2023/2024 Financial Statements"}]
[{"$f":"\"Rules with ERROR Status: \"&COUNTIF(C7:C179,\"ERROR\")","v":"Rules with ERROR Status: 1"},null,{"$f":"COUNTIF(C7:C179,\"ERROR\")","v":1},{"$f":"'Statement 1'!B3","v":"As at June 30, 2024"}]
[{"$f":"\"Rules with WARNING Status: \"&COUNTIF(C7:C179,\"WARNING\")","v":"Rules with WARNING Status: 0"},null,{"$f":"COUNTIF(C7:C179,\"WARNING\")","v":0}]
[{"$f":"\"Rules with OVERRIDE Status: \"&COUNTIF(C7:C179,\"Override\")","v":"Rules with OVERRIDE Status: 0"},null,{"$f":"COUNTIF(C7:C179,\"Override\")","v":0}]
[null,null,"STATUS"]
["Statement 1","\"Accumulated Surplus (Deficit)\" must match comprised section.",{"$f":"IF(OR(ISERROR('Statement 1'!C53)=TRUE,ISERROR('Statement 1'!C48)=TRUE),\"ERROR\",IF('Statement 1'!C53<>'Statement 1'!C48,\"ERROR\",\"Passed\"))","v":"Passed"}]
["Statement 1","\"Accumulated Surplus (Deficit)\" must match comprised section in the comparative period.",{"$f":"IF(OR(ISERROR('Statement 1'!D53)=TRUE,ISERROR('Statement 1'!D48)=TRUE),\"ERROR\",IF('Statement 1'!D53<>'Statement 1'!D48,\"ERROR\",\"Passed\"))","v":"Passed"}]
{"$rows_left_out":172}
{"sheet":"TOC","index":5,"n_rows":47,"n_cols":9,"rows_kept":47,"cut":false,"hidden":false,"merged":[[20,3,20,7],[9,3,9,7],[19,3,19,7],[3,5,3,7],[0,4,0,7],[1,5,1,7],[2,5,2,7],[4,5,4,7],[8,3,8,7]]}
[{"$f":"Cover!B15","v":"School District No. "},null,null,null,"Legend"]
[{"$f":"Cover!B19","v":"June 30, 2024"},null,null,null,null,"Links"]
[null,null,null,null,null,"Formulas"]
["Table of Contents",null,null,null,null,"No Entry"]
[null,null,null,null,null,"Verification Checks"]
[]
["Management Report ...........................................................................................................................................................................................",null,1]
[]
{"$rows_left_out":40}
{"sheet":"Management Report","index":6,"n_rows":26,"n_cols":10,"rows_kept":26,"cut":false,"hidden":false,"merged":[[25,6,25,8],[8,0,8,8],[12,0,12,8],[10,0,10,8],[14,0,14,8],[20,0,20,5],[20,6,20,8],[22,0,22,5],[22,6,22,8],[24,0,24,5],[24,6,24,8],[14,9,14,11],[4,0,4,8],[16,0,16,8],[21,6,21,8],[23,6,23,8]]}
[{"$f":"Cover!B15","v":"School District No. "}]
[]
[]
["MANAGEMENT REPORT"]
[{"$f":"IF(Variables!P7=\"\",\"DRAFT\",\"Version: \" & Variables!P7)","v":"DRAFT"}]
[]
[{"$f":"\"Management's Responsibility for the \"& PROPER(Variables!G23) &\"Financial Statements.\"","v":"Management's Responsibility for the Financial Statements."}]
[]
{"$rows_left_out":19}
{"sheet":"Statement 1","index":7,"n_rows":86,"n_cols":5,"rows_kept":86,"cut":false,"hidden":false,"merged":[[76,2,76,4],[82,2,84,4],[79,2,79,4],[70,1,70,4],[72,2,73,4],[0,1,0,3],[1,1,1,3],[2,1,2,3],[67,2,67,3],[65,2,65,3],[63,2,63,3],[54,1,54,3],[61,1,61,3],[62,2,62,3],[64,2,64,3],[66,2,66,3],[55,1,55,3],[56,1,56,3],[57,1,57,3],[58,1,58,3],[59,1,59,3]]}
[null,{"$f":"Cover!B15","v":"School District No. "}]
[null,{"$f":"PROPER(Variables!G23)& \"Statement of Financial Position\"","v":"Statement of Financial Position"},null,null,"Restatement Options:"]
[null,{"$f":"\"As at \"&Cover!B19","v":"As at June 30, 2024"}]
[null,null,{"$f":"IF(OR(Variables!F17=TRUE,Variables!F20=TRUE,Variables!F21=TRUE),Variables!C2,\"\")","v":""},{"$f":"IF(OR(Variables!F17=TRUE,Variables!F20=TRUE,Variables!F21=TRUE),Variables!B2,\"\")","v":""}]
[null,null,{"$f":"IF(OR(Variables!F17=TRUE,Variables!F20=TRUE,Variables!F21=TRUE),\"Actual\",Variables!C2)","v":"2024"},{"$f":"IF(OR(Variables!F17=TRUE,Variables!F20=TRUE,Variables!F21=TRUE),\"Actual\",Variables!B2)","v":"2023"}]
["Notes",null,{"$f":"IF(OR(Variables!F17=TRUE,Variables!F20=TRUE,Variables!F21=TRUE),\"\",\"Actual\")","v":"Actual"},{"$f":"IF(AND(Variables!F17=TRUE,Variables!F20=FALSE,Variables!F21=FALSE),\"\",IF(Variables!F20=TRUE,IF(A7=\"\",\"(Recast)\",\"(Recast - Note \"&A7&\")\"),IF(Variables!F21=TRUE,IF(A7=\"\",\"(Restated)\",\"(Restated - Note \"&A7&\")\"),\"Actual\")))","v":"Actual"}]
[null,null,"$","$"]
[null,"Financial Assets"]
{"$rows_left_out":79}
{"sheet":"Statement 2","index":8,"n_rows":54,"n_cols":6,"rows_kept":54,"cut":false,"hidden":false,"merged":[[50,2,50,5],[0,1,0,4],[1,1,1,4],[2,1,2,4],[53,2,53,5],[45,1,45,5],[47,2,47,5]]}
[null,{"$f":"Cover!B15","v":"School District No. "}]
[null,{"$f":"PROPER(Variables!G23)&\"Statement of Operations\"","v":"Statement of Operations"}]
[null,{"$f":"\"Year Ended \"&Cover!B19","v":"Year Ended June 30, 2024"}]
[null,null,null,null,null,"Budget Option:"]
[null,null,{"$f":"'Statement 1'!C4","v":""},{"$f":"'Statement 1'!C4","v":""},{"$f":"'Statement 1'!D4","v":""}]
[null,null,{"$f":"IF(OR(Variables!F17=TRUE,Variables!F20=TRUE,Variables!F21=TRUE),\"Budget\",Variables!C2)","v":"2024"},{"$f":"'Statement 1'!C5","v":"2024"},{"$f":"'Statement 1'!D5","v":"2023"}]
["Notes",null,{"$f":"IF(OR(Variables!F17=TRUE,Variables!F20=TRUE,Variables!F21=TRUE),IF(A8=\"\",\"\",\"(Note \"&A8&\")\"),\"Budget\")","v":"Budget"},{"$f":"'Statement 1'!C6","v":"Actual"},{"$f":"'Statement 1'!D6","v":"Actual"}]
[null,null,"$","$","$"]
{"$rows_left_out":47}
{"sheet":"Statement 3","index":9,"n_rows":33,"n_cols":5,"rows_kept":33,"cut":false,"hidden":false,"merged":[[30,2,31,4],[0,1,0,3],[1,1,1,3],[2,1,2,3],[23,1,23,4],[25,2,27,4]]}
[null,{"$f":"Cover!B15","v":"School District No. "}]
[null,{"$f":"PROPER(Variables!G23)&\"Statement of Remeasurement Gains and Losses\"","v":"Statement of Remeasurement Gains and Losses"}]
[null,{"$f":"\"Year Ended June 30, \"&Variables!C2","v":"Year Ended June 30, 2024"},null,null,"* If no values are entered on Statement 3, it will not print nor show up on the Table of Contents."]
[null,null,{"$f":"'Statement 1'!C4","v":""},{"$f":"'Statement 1'!D4","v":""}]
[null,null,{"$f":"'Statement 1'!C5","v":"2024"},{"$f":"'Statement 1'!D5","v":"2023"}]
["Notes",null,{"$f":"'Statement 1'!C6","v":"Actual"},{"$f":"'Statement 1'!D6","v":"Actual"}]
[null,null,"$","$"]
[]
{"$rows_left_out":26}
{"sheet":"Statement 4","index":10,"n_rows":48,"n_cols":6,"rows_kept":48,"cut":false,"hidden":false,"merged":[[46,2,46,5],[0,1,0,4],[1,1,1,4],[2,1,2,4],[43,2,43,5],[41,1,41,5]]}
[null,{"$f":"Cover!B15","v":"School District No. "}]
[null,{"$f":"PROPER(Variables!G23)&\"Statement of Changes in Net Debt\"","v":"Statement of Changes in Net Debt"}]
[null,{"$f":"\"Year Ended \"&Cover!B19","v":"Year Ended June 30, 2024"}]
[]
[null,null,{"$f":"'Statement 2'!C5","v":""},{"$f":"'Statement 2'!D5","v":""},{"$f":"'Statement 2'!E5","v":""}]
[null,null,{"$f":"'Statement 2'!C6","v":"2024"},{"$f":"'Statement 2'!D6","v":"2024"},{"$f":"'Statement 2'!E6","v":"2023"}]
["Notes",null,{"$f":"'Statement 2'!C7","v":"Budget"},{"$f":"'Statement 2'!D7","v":"Actual"},{"$f":"'Statement 1'!D6","v":"Actual"}]
[null,null,"$","$","$"]
{"$rows_left_out":41}
{"sheet":"Statement 5","index":11,"n_rows":80,"n_cols":5,"rows_kept":80,"cut":false,"hidden":false,"merged":[[77,2,78,4],[0,1,0,3],[1,1,1,3],[2,1,2,3],[69,1,69,4],[71,2,71,4],[74,2,74,4]]}
[null,{"$f":"Cover!B15","v":"School District No. "}]
[null,{"$f":"PROPER(Variables!G23)&\"Statement of Cash Flows\"","v":"Statement of Cash Flows"}]
[null,{"$f":"\"Year Ended \"&Cover!B19","v":"Year Ended June 30, 2024"}]
[null,null,{"$f":"'Statement 1'!C4","v":""},{"$f":"'Statement 1'!D4","v":""}]
[null,null,{"$f":"'Statement 1'!C5","v":"2024"},{"$f":"'Statement 1'!D5","v":"2023"}]
["Notes",null,{"$f":"'Statement 1'!C6","v":"Actual"},{"$f":"'Statement 1'!D6","v":"Actual"}]
[null,null,"$","$"]
[null,"Operating Transactions"]
{"$rows_left_out":73}
{"sheet":"Schedule 1","index":12,"n_rows":40,"n_cols":7,"rows_kept":40,"cut":false,"hidden":false,"merged":[[38,1,38,5],[35,1,35,6],[32,1,32,6],[0,0,0,5],[1,0,1,5],[2,0,2,5],[27,0,27,6],[29,1,29,6]]}
[{"$f":"Cover!B15","v":"School District No. "}]
[{"$f":"\"Schedule of Changes in Accumulated Surplus (Deficit) by Fund\"","v":"Schedule of Changes in Accumulated Surplus (Deficit) by Fund"}]
[{"$f":"\"Year Ended \"&Cover!B19","v":"Year Ended June 30, 2024"}]
[null,{"$f":"IF(Variables!F20=TRUE,\"Operating\",\"\")","v":""},{"$f":"IF(Variables!F20=TRUE,\"Special Purpose\",\"\")","v":""},{"$f":"IF(Variables!F20=TRUE,\"Capital\",\"\")","v":""},{"$f":"'Statement 1'!C4","v":""},{"$f":"'Statement 1'!D4","v":""}]
[null,{"$f":"IF(Variables!F20=TRUE,\"Fund\",\"Operating\")","v":"Operating"},{"$f":"IF(Variables!F20=TRUE,\"Fund\",\"Special Purpose\")","v":"Special Purpose"},{"$f":"IF(Variables!F20=TRUE,\"Fund\",\"Capital\")","v":"Capital"},{"$f":"'Statement 1'!C5","v":"2024"},{"$f":"'Statement 1'!D5","v":"2023"}]
[null,{"$f":"IF(Variables!F20=TRUE,\"\",\"Fund\")","v":"Fund"},{"$f":"IF(Variables!F20=TRUE,\"\",\"Fund\")","v":"Fund"},{"$f":"IF(Variables!F20=TRUE,\"\",\"Fund\")","v":"Fund"},{"$f":"'Statement 1'!C6","v":"Actual"},{"$f":"'Statement 1'!D6","v":"Actual"}]
[null,"$","$","$","$","$"]
[]
{"$rows_left_out":33}
{"sheet":"Schedule 2","index":13,"n_rows":87,"n_cols":6,"rows_kept":87,"cut":false,"hidden":false,"merged":[[85,2,85,5],[75,2,75,5],[78,2,78,5],[69,2,69,5],[81,2,82,5],[72,2,72,5],[65,2,66,5],[61,2,62,5],[0,1,0,4],[1,1,1,4],[2,1,2,4],[56,1,56,5],[58,2,58,5]]}
[null,{"$f":"Cover!B15","v":"School District No. "}]
[null,{"$f":"\"Schedule of Operating Operations\"","v":"Schedule of Operating Operations"}]
[null,{"$f":"\"Year Ended \"&Cover!B19","v":"Year Ended June 30, 2024"}]
[null,null,{"$f":"'Statement 2'!C5","v":""},{"$f":"'Statement 2'!D5","v":""},{"$f":"'Statement 2'!E5","v":""}]
[null,null,{"$f":"'Statement 2'!C6","v":"2024"},{"$f":"'Statement 2'!D6","v":"2024"},{"$f":"'Statement 2'!E6","v":"2023"}]
["Note",null,{"$f":"'Statement 2'!C7","v":"Budget"},{"$f":"'Statement 2'!D7","v":"Actual"},{"$f":"'Statement 1'!D6","v":"Actual"}]
[null,null,"$","$","$"]
[null,"Revenues"]
{"$rows_left_out":80}
{"sheet":"Schedule 2A","index":14,"n_rows":71,"n_cols":5,"rows_kept":71,"cut":false,"hidden":false,"merged":[[69,1,69,4],[0,0,0,3],[1,0,1,3],[2,0,2,3],[61,0,61,4],[63,1,63,4],[66,1,66,4]]}
[{"$f":"Cover!B15","v":"School District No. "}]
["Schedule of Operating Revenue by Source"]
[{"$f":"\"Year Ended \"&Cover!B19","v":"Year Ended June 30, 2024"}]
[null,{"$f":"'Statement 2'!C5","v":""},{"$f":"'Statement 2'!D5","v":""},{"$f":"'Statement 2'!E5","v":""}]
[null,{"$f":"'Statement 2'!C6","v":"2024"},{"$f":"'Statement 2'!D6","v":"2024"},{"$f":"'Statement 2'!E6","v":"2023"}]
[null,{"$f":"'Statement 2'!C7","v":"Budget"},{"$f":"'Statement 2'!D7","v":"Actual"},{"$f":"'Statement 1'!D6","v":"Actual"}]
[null,"$","$","$"]
["Provincial Grants - Ministry of Education and Child Care"]
{"$rows_left_out":64}
{"sheet":"Schedule 2B","index":15,"n_rows":48,"n_cols":5,"rows_kept":48,"cut":false,"hidden":false,"merged":[[47,1,47,4],[44,1,44,4],[0,0,0,3],[2,0,2,3],[1,0,1,3],[36,0,36,4],[38,1,38,4],[41,1,41,4]]}
[{"$f":"Cover!B15","v":"School District No. "}]
["Schedule of Operating Expense by Object"]
[{"$f":"\"Year Ended \"&Cover!B19","v":"Year Ended June 30, 2024"}]
[null,{"$f":"'Statement 2'!C5","v":""},{"$f":"'Statement 2'!D5","v":""},{"$f":"'Statement 2'!E5","v":""}]
[null,{"$f":"'Statement 2'!C6","v":"2024"},{"$f":"'Statement 2'!D6","v":"2024"},{"$f":"'Statement 2'!E6","v":"2023"}]
[null,{"$f":"'Statement 2'!C7","v":"Budget"},{"$f":"'Statement 2'!D7","v":"Actual"},{"$f":"'Statement 1'!D6","v":"Actual"}]
[null,"$","$","$"]
["Salaries"]
{"$rows_left_out":41}
{"sheet":"Schedule 2C","index":16,"n_rows":55,"n_cols":16,"rows_kept":55,"cut":false,"hidden":false,"merged":[[0,0,0,7],[1,0,1,7],[2,0,2,7],[51,0,51,15],[53,1,53,14]]}
[{"$f":"Cover!B15","v":"School District No. "}]
["Operating Expense by Function, Program and Object"]
[{"$f":"\"Year Ended June 30, \"&Variables!C2","v":"Year Ended June 30, 2024"}]
[null,null,"Principals and","Educational","Support","Other",null,null,null,null,null,null,{"$f":"'Statement 2'!D5","v":""},{"$f":"'Statement 2'!C5","v":""},{"$f":"'Statement 2'!E5","v":""}]
[null,"Teachers","Vice Principals","Assistants","Staff","Professionals","Substitutes","Total","Total","Employee","Total Salaries","Services and",{"$f":"'Statement 2'!D6","v":"2024"},{"$f":"'Statement 2'!C6","v":"2024"},{"$f":"'Statement 2'!E6","v":"2023"}]
[null,"Salaries","Salaries","Salaries","Salaries","Salaries","Salaries","Salaries","Salaries","Benefits","and Benefits","Supplies",{"$f":"'Statement 2'!D7","v":"Actual"},{"$f":"'Statement 2'!C7","v":"Budget"},{"$f":"'Statement 1'!D6","v":"Actual"}]
[null,"$","$","$","$","$","$","$","$","$","$","$","$","$","$"]
["1 Instruction"]
{"$rows_left_out":48}
{"sheet":"Schedule 3","index":17,"n_rows":90,"n_cols":5,"rows_kept":90,"cut":false,"hidden":false,"merged":[[73,1,73,4],[76,1,76,4],[79,1,79,4],[82,1,82,4],[88,1,88,4],[85,1,85,4],[64,1,64,4],[61,1,61,4],[67,1,67,4],[70,1,70,4],[0,0,0,3],[2,0,2,3],[1,0,1,3],[56,0,56,4],[58,1,58,4]]}
[{"$f":"Cover!B15","v":"School District No. "}]
[{"$f":"\"Schedule of Special Purpose Operations\"","v":"Schedule of Special Purpose Operations"}]
[{"$f":"\"Year Ended \"&Cover!B19","v":"Year Ended June 30, 2024"}]
[null,{"$f":"'Statement 2'!C5","v":""},{"$f":"'Statement 2'!D5","v":""},{"$f":"'Statement 2'!E5","v":""}]
[null,{"$f":"'Statement 2'!C6","v":"2024"},{"$f":"'Statement 2'!D6","v":"2024"},{"$f":"'Statement 2'!E6","v":"2023"}]
[null,{"$f":"'Statement 2'!C7","v":"Budget"},{"$f":"'Statement 2'!D7","v":"Actual"},{"$f":"'Statement 1'!D6","v":"Actual"}]
[null,"$","$","$"]
["Revenues"]
{"$rows_left_out":83}
{"sheet":"Schedule 3A","index":18,"n_rows":87,"n_cols":47,"rows_kept":87,"cut":false,"hidden":false,"merged":[[0,0,0,45],[1,0,1,45],[2,0,2,45],[61,0,61,45],[20,46,22,46]]}
[{"$f":"Cover!B15","v":"School District No. "}]
["Changes in Special Purpose Funds and Expense by Object"]
[{"$f":"\"Year Ended June 30, \"&Variables!C2","v":"Year Ended June 30, 2024"}]
[null,null,null,null,null,null,null,null,null,null,null,null,null,null,null,null,null,null,null,null,null,"Safe Return","Federal Safe",null,null,null,null,null,null,"New","New"]
[null,null,"Annual","Learning","Spare","Special","Scholarships","Service","Special","School",null,null,"Ready,",null,null,"Classroom","Classroom","Classroom","First Nation","Mental","Changing","to School /","Return to","Seamless","Early Childhood","Student &",null,"SEY2KT","ECL","Feeding","Health"]
[null,null,"Facility","Improvement",null,"Education","and","Delivery","Education","Generated","Related","Strong","Set,",null,null,"Enhancement","Enhancement","Enhancement","Student","Health","Results for","Restart: Health","Class /","Day","Education Dual","Family","JUST","(Early Years to","(Early Care","Futures","Career","District","District","District","District","District","District","District","District","District","District","District","District","District","District"]
[null,null,"Grant","Fund",null,"Equipment","Bursaries","Transformation","Technology","Funds","Entities","Start","Learn","OLEP","CommunityLINK","Fund - Overhead","Fund - Staffing","Fund - Remedies","Transportation","in Schools","Young Children","& Safety Grant","Ventilation Fund","Kindergarten","Credit Program","Affordability","B4","Kindergarten)","& Learning)","Fund","Grants","Entered","Entered","Entered","Entered","Entered","Entered","Entered","Entered","Entered","Entered","Entered","Entered","Entered","Entered","TOTAL"]
[null,null,"$","$","$","$","$","$","$","$","$","$","$","$","$","$","$","$","$","$","$","$","$","$","$","$","$","$","$","$","$","$","$","$","$","$","$","$","$","$","$","$","$","$","$","$"]
{"$rows_left_out":80}
{"sheet":"Schedule 4","index":19,"n_rows":118,"n_cols":7,"rows_kept":118,"cut":false,"hidden":false,"merged":[[113,1,113,6],[116,1,116,6],[110,1,110,5],[85,1,85,6],[3,2,3,4],[103,1,103,6],[106,1,107,6],[88,1,88,6],[91,1,91,6],[94,1,94,6],[100,1,100,6],[82,1,82,6],[97,1,97,6],[0,0,0,5],[1,0,1,5],[2,0,2,5],[69,0,69,6],[78,1,79,6],[74,1,75,6],[25,6,26,6],[71,1,71,6]]}
[{"$f":"Cover!B15","v":"School District No. "}]
[{"$f":"\"Schedule of Capital Operations\"","v":"Schedule of Capital Operations"}]
[{"$f":"\"Year Ended \"&Cover!B19","v":"Year Ended June 30, 2024"}]
[null,{"$f":"'Statement 2'!C5","v":""},{"$f":"Variables!C2 & \" Actual\"","v":"2024 Actual"},null,null,{"$f":"'Statement 2'!E5","v":""}]
[null,{"$f":"'Statement 2'!C6","v":"2024"},"Invested in Tangible","Local","Fund",{"$f":"'Statement 2'!E6","v":"2023"}]
[null,{"$f":"'Statement 2'!C7","v":"Budget"},"Capital Assets","Capital","Balance",{"$f":"'Statement 1'!D6","v":"Actual"}]
[null,"$","$","$","$","$"]
["Revenues"]
{"$rows_left_out":111}
{"sheet":"Schedule 4A","index":20,"n_rows":77,"n_cols":9,"rows_kept":77,"cut":false,"hidden":false,"merged":[[0,0,0,7],[1,0,1,7],[2,0,2,7],[52,0,52,8],[75,1,75,7],[59,1,60,7],[63,1,64,7],[67,1,68,7],[71,1,72,7],[54,1,55,7]]}
[{"$f":"Cover!B15","v":"School District No. "}]
["Tangible Capital Assets"]
[{"$f":"\"Year Ended June 30, \"&Variables!C2","v":"Year Ended June 30, 2024"}]
[]
[null,null,null,"Furniture and",null,"Computer","Computer"]
[null,"Sites","Buildings","Equipment","Vehicles","Software","Hardware","Total"]
[null,"$","$","$","$","$","$","$"]
["Cost, beginning of year",null,null,null,null,null,null,{"$f":"SUM(B8:G8)","v":0}]
{"$rows_left_out":70}
{"sheet":"Schedule 4B","index":21,"n_rows":60,"n_cols":7,"rows_kept":60,"cut":false,"hidden":false,"merged":[[58,1,58,5],[44,1,46,5],[49,1,51,5],[54,1,55,5],[0,0,0,5],[1,0,1,5],[2,0,2,5],[31,0,31,6],[33,1,35,5],[39,1,41,5]]}
[{"$f":"Cover!B15","v":"School District No. "}]
["Tangible Capital Assets - Work in Progress",null,null,null,null,null,"* If no values are entered on Schedule 4B, it will not print nor show up on the Table of Contents."]
[{"$f":"\"Year Ended June 30, \"&Variables!C2","v":"Year Ended June 30, 2024"}]
[]
[null,null,"Furniture and","Computer","Computer"]
[null,"Buildings","Equipment","Software","Hardware","Total"]
[null,"$","$","$","$","$"]
["Work in Progress, beginning of year",null,null,null,null,{"$f":"SUM(B8:E8)","v":0}]
{"$rows_left_out":53}
{"sheet":"Schedule 4C","index":22,"n_rows":69,"n_cols":6,"rows_kept":69,"cut":false,"hidden":false,"merged":[[67,1,67,4],[0,0,0,4],[1,0,1,4],[2,0,2,4],[55,0,55,5],[57,1,59,4],[62,1,64,4]]}
[{"$f":"Cover!B15","v":"School District No. "}]
["Deferred Capital Revenue"]
[{"$f":"\"Year Ended June 30, \"&Variables!C2","v":"Year Ended June 30, 2024"}]
[]
[null,"Bylaw","Other","Other","Total"]
[null,"Capital","Provincial","Capital","Capital"]
[null,"$","$","$","$"]
["Deferred Capital Revenue, beginning of year",null,null,null,{"$f":"SUM(B8:D8)","v":0}]
{"$rows_left_out":62}
{"sheet":"Schedule 4D","index":23,"n_rows":51,"n_cols":8,"rows_kept":51,"cut":false,"hidden":false,"merged":[[43,1,43,6],[49,1,49,6],[46,1,46,6],[0,0,0,6],[1,0,1,6],[2,0,2,6],[40,1,40,6],[38,0,38,7]]}
[{"$f":"Cover!B15","v":"School District No. "}]
["Changes in Unspent Deferred Capital Revenue"]
[{"$f":"\"Year Ended June 30, \"&Variables!C2","v":"Year Ended June 30, 2024"}]
[]
[null,null,"MECC","Other"]
[null,"Bylaw","Restricted","Provincial","Land","Other"]
[null,"Capital","Capital","Capital","Capital","Capital","Total"]
[null,"$","$","$","$","$","$"]
{"$rows_left_out":43}