{"text_format":"1","workbook":"xlsx","n_sheets":17,"sheets":["Data","Variables","Key Features","Cover","TOC","Verification","Bylaw","Statement 2","Statement 4","Schedule 1","Schedule 2","Schedule 2A","Schedule 2B","Schedule 2C","Schedule 3","Schedule 3A","Schedule 4"],"not_rendered":{"charts":0,"images":44,"macros":1,"external_links":0,"defined_names":27,"comments":1,"pivot_tables":0},"unopened":[],"bounds":{"document_bytes":16777216,"sheet_cells":100000,"rows_first":2000,"rows_last":500,"rows_between":2000,"halvings":0,"cell_chars":16384,"cell_head_chars":4096},"cells_cut":0,"cells_raw":0,"read":"whole","date_system":"1900"}

{"sheet":"Data","index":0,"n_rows":2715,"n_cols":6,"rows_kept":2715,"cut":false,"hidden":true,"merged":[]}
[]
["Page","Column","Category","Heading","Sub-Heading",{"$f":"Variables!P2","v":""}]
["Cover","Package",null,null,null,{"$f":"Cover!B14","v":"Annual Budget"}]
["Cover","Year",null,null,null,{"$f":"Variables!A2","v":"2024/2025"}]
["Cover","Prior Year",null,null,null,{"$f":"Variables!F8","v":""}]
["Cover","Version Number",null,null,null,{"$f":"Variables!P7","v":0}]
["Cover","Person to Finalize",null,null,null,{"$f":"Variables!P10","v":0}]
["Cover","Time Stamp",null,null,null,{"$f":"Variables!P13","v":0}]
["Bylaw","First - Month",null,null,null,{"$f":"Variables!F20","v":"- Month -"}]
["Bylaw","First - Day",null,null,null,{"$f":"Variables!G20","v":"- Day -"}]
{"$rows_left_out":2706}
{"sheet":"Variables","index":1,"n_rows":61,"n_cols":23,"rows_kept":61,"cut":false,"hidden":true,"merged":[[0,14,0,15],[0,5,0,6],[26,4,26,6],[13,4,13,6]]}
["Program Year",null,"Sept.","June",null,"Bylaw - Schedule #",null,null,null,1,null,"SD","Name",null,"Choice",null,null,"Username","Date & Time","Old Version #","Old Username","Old Finalize Date","Reason"]
[{"$f":"RIGHT(Cover!B18,4)-1 & \"/\" & RIGHT(Cover!B18,4)","v":"2024/2025"},null,{"$f":"LEFT(A2,4)","v":"2024"},{"$f":"RIGHT(A2,4)","v":"2025"},null,2,null,null,null,2,"05 (Southeast Kootenay)",{"$f":"LEFT(K2,2)","v":"05"},{"$f":"MID(K2,5,(LEN(K2)-5))","v":"Southeast Kootenay"},null,{"$f":"IF(P2 = \"\",\"\",VLOOKUP(P2,SD_lookup,2,FALSE) )","v":""},"",1]
[null,null,null,null,null,null,null,null,null,3,"06 (Rocky Mountain)","06","Rocky Mountain",null,null,null,2]
[null,null,null,null,null,null,null,null,null,4,"08 (Kootenay Lake)","08","Kootenay Lake",null,null,null,3]
[null,null,null,null,null,null,null,null,null,5,"10 (Arrow Lakes)","10","Arrow Lakes",null,null,"Current"]
["Comparative",null,null,null,null,"Comparative Choice",null,null,null,6,"19 (Revelstoke)","19","Revelstoke",null,null,"Version #"]
[null,1,null,null,null,{"$f":"IF(F8 = \"\",1,VLOOKUP(F8,A7:B9,2,FALSE))","v":1},null,null,null,7,"20 (Kootenay-Columbia)","20","Kootenay-Columbia"]
[{"$f":"C2-1&\"/\"&D2-1&\" \"&A12&\" \"&A13","v":"2023/2024 Amended Annual Budget"},2,null,null,null,"",null,null,null,8,"22 (Vernon)","22","Vernon"]
[{"$f":"IF(Cover!B14=\"Annual Budget\",C2-1&\"/\"&D2-1,C2&\"/\"&D2)&\" \"&A13","v":"2023/2024 Annual Budget"},3,null,null,null,null,null,null,null,9,"23 (Central Okanagan)","23","Central Okanagan",null,null,"Person to Finalize"]
[null,null,null,null,null,null,null,null,null,10,"27 (Cariboo-Chilcotin)","27","Cariboo-Chilcotin"]
{"$rows_left_out":52}
{"sheet":"Key Features","index":2,"n_rows":54,"n_cols":2,"rows_kept":54,"cut":false,"hidden":false,"merged":[[0,0,0,10],[1,0,1,10],[8,1,8,6]]}
[{"$f":"\"Welcome to the \"&Variables!A2&\" \"&Cover!B14&\" Excel package.\"","v":"Welcome to the 2024/2025 Annual Budget Excel package."}]
[]
["System Requirements:"]
["- At this time, Excel for Mac is NOT supported."]
["New Features:"]
[]
["1.)  Macros MUST be enabled and the document saved in the .xlsm format."]
[null,"Note:  Once document is saved in the .xlsx format, it is no longer functional and cannot be converted back"]
[null,"(Please click here to see how to enable Macros)"]
[]
{"$rows_left_out":45}
{"sheet":"Cover","index":3,"n_rows":18,"n_cols":16,"rows_kept":18,"cut":false,"hidden":false,"merged":[[12,14,12,17],[32,0,32,9],[0,10,0,13],[3,10,3,13],[11,13,11,14],[11,15,11,17]]}
[null,null,null,null,null,null,null,null,null,null,{"$f":"IF(Variables!P7=\"\",\"Please Select Your School District\",\"\")","v":"Please Select Your School District"}]
[]
[]
[null,null,null,null,null,null,null,null,null,null,{"$f":"IF(Variables!P7=\"\",\"Please Select Your Prior Year Source\",\"\")","v":"Please Select Your Prior Year Source"}]
[]
[]
[]
[]
[]
[]
{"$rows_left_out":9}
{"sheet":"TOC","index":4,"n_rows":31,"n_cols":6,"rows_kept":31,"cut":false,"hidden":false,"merged":[[0,4,0,7],[1,5,1,7],[2,5,2,7],[3,5,3,7],[4,5,4,7]]}
[{"$f":"Cover!B16","v":"School District No. "},null,null,null,"Legend"]
[{"$f":"Cover!B18","v":"June 30, 2025"},null,null,null,null,"Links"]
[null,null,null,null,null,"Formulas"]
["Table of Contents",null,null,null,null,"Verification Checks"]
[null,null,null,null,null,"No Entry"]
[]
["Bylaw  ..........................................................................................................................................................................................................",null,1]
[]
[{"$f":"Cover!B14&\" - Revenue and Expense - Statement 2\" & \"  ..........................................................................................................................................\"","v":"Annual Budget - Revenue and Expense - Statement 2  .........................................................................................................................................."},null,2]
[]
{"$rows_left_out":22}
{"sheet":"Verification","index":5,"n_rows":71,"n_cols":4,"rows_kept":71,"cut":false,"hidden":false,"merged":[[14,6,14,8],[0,0,0,1],[1,0,1,1],[2,0,2,1],[3,0,3,1],[13,6,13,8]]}
[{"$f":"\"Total Number of Rules Applicable to the \" & Cover!B14 & \": \"& COUNTA(A7:A71)","v":"Total Number of Rules Applicable to the Annual Budget: 65"},null,null,{"$f":"Cover!B16","v":"School District No. "}]
[{"$f":"\"Rules with Passed Status: \"&COUNTIF(C7:C71,\"Passed\")","v":"Rules with Passed Status: 63"},null,null,{"$f":"Cover!B14","v":"Annual Budget"}]
[{"$f":"\"Rules with ERROR Status: \"&C3","v":"Rules with ERROR Status: 2"},null,{"$f":"COUNTIF(C7:C71,\"ERROR\")+COUNTIF(C14:C15,\"ERROR - No Override Required\")","v":2},{"$f":"\"As At \" & Cover!B18","v":"As At June 30, 2025"}]
[{"$f":"\"Rules with WARNING Status: \"&C4","v":"Rules with WARNING Status: 0"},null,{"$f":"COUNTIF(C7:C71,\"WARNING\")","v":0}]
[{"$f":"\"Rules with OVERRIDE Status: \"&C5","v":"Rules with OVERRIDE Status: 0"},null,{"$f":"COUNTIF(C7:C71,\"Override\")","v":0}]
[null,null,"STATUS"]
["Statement 2","\"Ministry Funded School-Age FTE\" can not be zero.",{"$f":"IF(ISERROR('Statement 2'!B8)=TRUE,\"ERROR\",IF('Statement 2'!B8=0,\"ERROR\",\"Passed\"))","v":"ERROR"}]
["Statement 2","\"Ministry Funded School-Age FTE\" can not be zero in the comparative period.",{"$f":"IF(ISERROR('Statement 2'!C8)=TRUE,\"ERROR\",IF('Statement 2'!C8=0,\"ERROR\",\"Passed\"))","v":"ERROR"}]
["Statement 2","A description other than ''District Entered'' must be entered.",{"$f":"IF('Statement 2'!B85=\"ERROR\",\"ERROR\",\"Passed\")","v":"Passed"}]
["Statement 4","\"From Local Capital\" must be negative or zero in the comparative period.",{"$f":"IF(ISERROR('Statement 4'!C14)=TRUE,\"ERROR\",IF('Statement 4'!C14>0,\"ERROR\",\"Passed\"))","v":"Passed"}]
{"$rows_left_out":62}
{"sheet":"Bylaw","index":6,"n_rows":44,"n_cols":13,"rows_kept":44,"cut":false,"hidden":false,"merged":[[0,0,0,9],[29,6,29,8],[33,6,33,8],[43,6,43,8],[27,6,28,8],[31,6,32,8],[41,6,42,8]]}
[{"$f":"UPPER(Cover!B14)&\" BYLAW\"","v":"ANNUAL BUDGET BYLAW"}]
[]
[{"$f":"\"A Bylaw of THE BOARD OF EDUCATION OF \"&UPPER(Cover!B16)","v":"A Bylaw of THE BOARD OF EDUCATION OF SCHOOL DISTRICT NO. "}]
[{"$f":"\"(called the ''Board'') to adopt the \"&Cover!B14&\" of the Board for the fiscal year \"&Variables!A2&\" pursuant\"","v":"(called the ''Board'') to adopt the Annual Budget of the Board for the fiscal year 2024/2025 pursuant"}]
["to section 113 of the School Act, R.S.B.C., 1996, c. 412 as amended from time to time (called the \"Act\").",null,null,null,null,null,null,null,null,null,null,"* Please Note:"]
[null,null,null,null,null,null,null,null,null,null,null,null,"The dates and Seal option are not locked down after Finalization is complete."]
["1.","The Board has complied with the provisions of the Act, Ministerial Orders, and Ministry of",null,null,null,null,null,null,null,null,null,null,"This is to allow for meeting schedule changes/updates."]
[null,{"$f":"\"Education and Child Care Policies respecting the \"&Cover!B14&\" adopted by this bylaw.\"","v":"Education and Child Care Policies respecting the Annual Budget adopted by this bylaw."}]
[]
["2.",{"$f":"\"This bylaw may be cited as \"&Cover!B16","v":"This bylaw may be cited as School District No. "}]
{"$rows_left_out":35}
{"sheet":"Statement 2","index":7,"n_rows":85,"n_cols":4,"rows_kept":85,"cut":false,"hidden":false,"merged":[[69,0,69,1],[70,1,70,2],[71,1,71,2],[0,0,0,2],[1,0,1,2],[2,0,2,2],[84,1,84,3],[72,1,72,2],[80,1,80,3],[78,0,78,3],[73,1,73,2],[75,1,75,2],[74,1,74,2],[83,1,83,3]]}
[{"$f":"Cover!B16","v":"School District No. "}]
[{"$f":"Cover!B14&\" - Revenue and Expense\"","v":"Annual Budget - Revenue and Expense"}]
[{"$f":"\"Year Ended \"&Cover!B18","v":"Year Ended June 30, 2025"}]
[]
[null,{"$f":"IF(Cover!$B$14=\"Annual Budget\",RIGHT(Cover!$B$18,4),RIGHT(Cover!$B$18,4) & \" \" & Variables!$A$12)","v":"2025"},{"$f":"IF(CompCh=1,\"Please Select\",IF(CompCh=2,Variables!$C$2 &\" \" &Variables!$A$12,IF(Cover!$B$14=\"Annual Budget\",Variables!$C$2,Variables!$D$2)))","v":"Please Select"}]
[null,{"$f":"Variables!$A$13","v":"Annual Budget"},{"$f":"IF(CompCh=1,\"Prior Year Source\",Variables!$A$13)","v":"Prior Year Source"}]
["Ministry Operating Grant Funded FTE's"]
["School-Age",null,null,{"$f":"IF(OR(B82=\"ERROR\",C82=\"ERROR\"),\"ERROR - See below\",\"\")","v":"ERROR - See below"}]
["Adult"]
["Other"]
{"$rows_left_out":76}
{"sheet":"Statement 4","index":8,"n_rows":51,"n_cols":4,"rows_kept":51,"cut":false,"hidden":false,"merged":[[49,1,49,3],[43,1,43,3],[0,0,0,2],[1,0,1,2],[2,0,2,2],[41,0,41,3],[46,1,46,3]]}
[{"$f":"Cover!B16","v":"School District No. "}]
[{"$f":"Cover!B14&\" - Changes in Net Financial Assets (Debt)\"","v":"Annual Budget - Changes in Net Financial Assets (Debt)"}]
[{"$f":"\"Year Ended \"&Cover!B18","v":"Year Ended June 30, 2025"}]
[]
[null,{"$f":"IF(Cover!$B$14=\"Annual Budget\",RIGHT(Cover!$B$18,4),RIGHT(Cover!$B$18,4) & \" \" & Variables!$A$12)","v":"2025"},{"$f":"IF(CompCh=1,\"Please Select\",IF(CompCh=2,Variables!$C$2 &\" \" &Variables!$A$12,IF(Cover!$B$14=\"Annual Budget\",Variables!$C$2,Variables!$D$2)))","v":"Please Select"}]
[null,{"$f":"Variables!$A$13","v":"Annual Budget"},{"$f":"IF(CompCh=1,\"Prior Year Source\",Variables!$A$13)","v":"Prior Year Source"}]
[null,"$","$"]
[]
["Surplus (Deficit) for the year",{"$f":"IF(SUM('Statement 2'!B39)=0,\"\",SUM('Statement 2'!B39))","v":""},{"$f":"IF(SUM('Statement 2'!C39)=0,\"\",SUM('Statement 2'!C39))","v":""}]
[]
{"$rows_left_out":42}
{"sheet":"Schedule 1","index":9,"n_rows":32,"n_cols":6,"rows_kept":32,"cut":false,"hidden":true,"merged":[[30,1,30,5],[0,0,0,4],[1,0,1,4],[2,0,2,4],[22,0,22,5],[24,1,24,5],[27,1,27,5]]}
[{"$f":"Cover!B16","v":"School District No. "}]
[{"$f":"Cover!B14&\" - Schedule of Changes in Accumulated Surplus (Deficit) by Fund\"","v":"Annual Budget - Schedule of Changes in Accumulated Surplus (Deficit) by Fund"}]
[{"$f":"\"Year Ended \"&Cover!B18","v":"Year Ended June 30, 2025"}]
[]
[null,"Operating","Special Purpose","Capital",{"$f":"IF(Cover!$B$14=\"Annual Budget\",RIGHT(Cover!$B$18,4),RIGHT(Cover!$B$18,4) & \" \" & Variables!$A$12)","v":"2025"}]
[null,"Fund","Fund","Fund",{"$f":"Variables!$A$13","v":"Annual Budget"}]
[null,"$","$","$","$"]
[]
["Accumulated Surplus (Deficit), beginning of year",null,null,null,{"$f":"SUM(B9:D9)","v":0},{"$f":"IF(OR(B32=\"ERROR\",C32=\"ERROR\",D32=\"ERROR\"),\"ERROR - See below\",\"\")","v":""}]
[]
{"$rows_left_out":23}
{"sheet":"Schedule 2","index":10,"n_rows":76,"n_cols":5,"rows_kept":76,"cut":false,"hidden":false,"merged":[[67,1,68,6],[71,1,72,6],[60,1,60,6],[74,1,74,3],[43,0,43,6],[63,1,64,6],[0,0,0,2],[1,0,1,2],[2,0,2,2],[28,4,30,6],[57,1,57,6],[45,1,45,6],[48,1,48,6],[51,1,51,6],[54,1,54,6]]}
[{"$f":"Cover!B16","v":"School District No. "}]
[{"$f":"Cover!B14&\" - Operating Revenue and Expense\"","v":"Annual Budget - Operating Revenue and Expense"}]
[{"$f":"\"Year Ended \"&Cover!B18","v":"Year Ended June 30, 2025"}]
[]
[null,{"$f":"IF(Cover!$B$14=\"Annual Budget\",RIGHT(Cover!$B$18,4),RIGHT(Cover!$B$18,4) & \" \" & Variables!$A$12)","v":"2025"},{"$f":"IF(CompCh=1,\"Please Select\",IF(CompCh=2,Variables!$C$2 &\" \" &Variables!$A$12,IF(Cover!$B$14=\"Annual Budget\",Variables!$C$2,Variables!$D$2)))","v":"Please Select"}]
[null,{"$f":"Variables!$A$13","v":"Annual Budget"},{"$f":"IF(CompCh=1,\"Prior Year Source\",Variables!$A$13)","v":"Prior Year Source"}]
[null,"$","$"]
["Revenues"]
["Provincial Grants"]
["Ministry of Education and Child Care",{"$f":"IF(SUM('Schedule 2A'!B27)=0,\"\",SUM('Schedule 2A'!B27))","v":""},{"$f":"IF(SUM('Schedule 2A'!C27)=0,\"\",SUM('Schedule 2A'!C27))","v":""}]
{"$rows_left_out":67}
{"sheet":"Schedule 2A","index":11,"n_rows":70,"n_cols":4,"rows_kept":70,"cut":false,"hidden":false,"merged":[[68,1,68,3],[0,0,0,2],[1,0,1,2],[2,0,2,2],[60,0,60,3],[62,1,62,3],[65,1,65,3]]}
[{"$f":"Cover!B16","v":"School District No. "}]
[{"$f":"Cover!B14&\" - Schedule of Operating Revenue by Source\"","v":"Annual Budget - Schedule of Operating Revenue by Source"}]
[{"$f":"\"Year Ended \"&Cover!B18","v":"Year Ended June 30, 2025"}]
[]
[null,{"$f":"IF(Cover!$B$14=\"Annual Budget\",RIGHT(Cover!$B$18,4),RIGHT(Cover!$B$18,4) & \" \" & Variables!$A$12)","v":"2025"},{"$f":"IF(CompCh=1,\"Please Select\",IF(CompCh=2,Variables!$C$2 &\" \" &Variables!$A$12,IF(Cover!$B$14=\"Annual Budget\",Variables!$C$2,Variables!$D$2)))","v":"Please Select"}]
[null,{"$f":"Variables!$A$13","v":"Annual Budget"},{"$f":"IF(CompCh=1,\"Prior Year Source\",Variables!$A$13)","v":"Prior Year Source"}]
[null,"$","$"]
["Provincial Grants - Ministry of Education and Child Care"]
["Operating Grant, Ministry of Education and Child Care"]
["ISC/LEA Recovery",null,null,{"$f":"IF(OR(B64=\"ERROR\",C64=\"ERROR\",B67=\"ERROR\",C67=\"ERROR\"),\"ERROR - See below\",\"\")","v":""}]
{"$rows_left_out":61}
{"sheet":"Schedule 2B","index":12,"n_rows":48,"n_cols":4,"rows_kept":48,"cut":false,"hidden":false,"merged":[[47,1,47,3],[40,1,40,2],[46,2,46,3],[0,0,0,2],[1,0,1,2],[2,0,2,2],[35,0,35,3],[37,1,38,3],[42,1,44,3]]}
[{"$f":"Cover!B16","v":"School District No. "}]
[{"$f":"Cover!B14&\" - Schedule of Operating Expense by Object\"","v":"Annual Budget - Schedule of Operating Expense by Object"}]
[{"$f":"\"Year Ended \"&Cover!B18","v":"Year Ended June 30, 2025"}]
[]
[null,{"$f":"IF(Cover!$B$14=\"Annual Budget\",RIGHT(Cover!$B$18,4),RIGHT(Cover!$B$18,4) & \" \" & Variables!$A$12)","v":"2025"},{"$f":"IF(CompCh=1,\"Please Select\",IF(CompCh=2,Variables!$C$2 &\" \" &Variables!$A$12,IF(Cover!$B$14=\"Annual Budget\",Variables!$C$2,Variables!$D$2)))","v":"Please Select"}]
[null,{"$f":"Variables!$A$13","v":"Annual Budget"},{"$f":"IF(CompCh=1,\"Prior Year Source\",Variables!$A$13)","v":"Prior Year Source"}]
[null,"$","$"]
["Salaries"]
["Teachers",{"$f":"IF(SUM('Schedule 2C'!B51)=0,\"\",SUM('Schedule 2C'!B51))","v":""}]
["Principals and Vice Principals",{"$f":"IF(SUM('Schedule 2C'!C51)=0,\"\",SUM('Schedule 2C'!C51))","v":""}]
{"$rows_left_out":39}
{"sheet":"Schedule 2C","index":13,"n_rows":57,"n_cols":15,"rows_kept":57,"cut":false,"hidden":false,"merged":[[55,1,55,14],[0,0,0,7],[1,0,1,7],[2,0,2,7],[53,0,53,14]]}
[{"$f":"Cover!B16","v":"School District No. "}]
[{"$f":"Cover!B14&\" - Operating Expense by Function, Program and Object\"","v":"Annual Budget - Operating Expense by Function, Program and Object"}]
[{"$f":"\"Year Ended \"&Cover!B18","v":"Year Ended June 30, 2025"}]
[]
[null,null,"Principals and","Educational","Support","Other"]
[null,"Teachers","Vice Principals","Assistants","Staff","Professionals","Substitutes","Total","Total","Employee","Total Salaries","Services and",{"$f":"IF(Cover!$B$14=\"Annual Budget\",RIGHT(Cover!$B$18,4),RIGHT(Cover!$B$18,4) & \" \" & Variables!$A$12)","v":"2025"},{"$f":"IF(CompCh=1,\"Please Select\",IF(CompCh=2,Variables!$C$2 &\" \" &Variables!$A$12,IF(Cover!$B$14=\"Annual Budget\",Variables!$C$2,Variables!$D$2)))","v":"Please Select"}]
[null,"Salaries","Salaries","Salaries","Salaries","Salaries","Salaries","Salaries","Salaries","Benefits","and Benefits","Supplies",{"$f":"Variables!$A$13","v":"Annual Budget"},{"$f":"IF(CompCh=1,\"Prior Year Source\",Variables!$A$13)","v":"Prior Year Source"}]
[null,"$","$","$","$","$","$","$","$","$","$","$","$","$"]
["1 Instruction"]
["1.02 Regular Instruction",null,null,null,null,null,null,{"$f":"SUM(B10:G10)","v":0},{"$f":"H10","v":0},null,{"$f":"SUM(H10)+SUM(J10)","v":0},null,{"$f":"SUM(K10)+SUM(L10)","v":0}]
{"$rows_left_out":48}
{"sheet":"Schedule 3","index":14,"n_rows":68,"n_cols":4,"rows_kept":68,"cut":false,"hidden":false,"merged":[[46,1,46,3],[43,0,43,3],[0,0,0,2],[1,0,1,2],[2,0,2,2],[45,1,45,3],[49,1,50,3],[53,1,54,3],[57,1,58,3],[65,1,66,3],[61,1,62,3]]}
[{"$f":"Cover!B16","v":"School District No. "}]
[{"$f":"Cover!B14&\" - Special Purpose Revenue and Expense\"","v":"Annual Budget - Special Purpose Revenue and Expense"}]
[{"$f":"\"Year Ended \"&Cover!B18","v":"Year Ended June 30, 2025"}]
[]
[null,{"$f":"IF(Cover!$B$14=\"Annual Budget\",RIGHT(Cover!$B$18,4),RIGHT(Cover!$B$18,4) & \" \" & Variables!$A$12)","v":"2025"},{"$f":"IF(CompCh=1,\"Please Select\",IF(CompCh=2,Variables!$C$2 &\" \" &Variables!$A$12,IF(Cover!$B$14=\"Annual Budget\",Variables!$C$2,Variables!$D$2)))","v":"Please Select"}]
[null,{"$f":"Variables!$A$13","v":"Annual Budget"},{"$f":"IF(CompCh=1,\"Prior Year Source\",Variables!$A$13)","v":"Prior Year Source"}]
[null,"$","$"]
["Revenues"]
["Provincial Grants"]
["Ministry of Education and Child Care",{"$f":"IF(SUM('Schedule 3A'!AT26)=0,\"\",SUM('Schedule 3A'!AT26))","v":""}]
{"$rows_left_out":59}
{"sheet":"Schedule 3A","index":15,"n_rows":87,"n_cols":47,"rows_kept":87,"cut":false,"hidden":false,"merged":[[0,0,0,45],[1,0,1,45],[2,0,2,45],[61,0,61,45],[19,46,21,46]]}
[{"$f":"Cover!B16","v":"School District No. "}]
[{"$f":"Cover!B14&\" - Changes in Special Purpose Funds\"","v":"Annual Budget - Changes in Special Purpose Funds"}]
[{"$f":"\"Year Ended \"&Cover!B18","v":"Year Ended June 30, 2025"}]
[null,null,null,null,null,null,null,null,null,null,null,null,null,null,null,null,null,null,null,null,"Safe Return","Federal Safe",null,null,null,null,null,null,null,"New"]
[null,null,"Annual","Learning","Spare","Special","Scholarships","Special","School",null,null,"Ready,",null,null,"Classroom","Classroom","Classroom","First Nation","Mental","Changing","to School /","Return to","Seamless","Early Childhood","Student &",null,"SEY2KT","ECL","Feeding","Health Career"]
[null,null,"Facility","Improvement",null,"Education","and","Education","Generated","Related","Strong","Set,",null,null,"Enhancement","Enhancement","Enhancement","Student","Health","Results for","Restart: Health","Class /","Day","Education Dual","Family","JUST","(Early Years to","Early Care","Futures","Dual Credit","District","District","District","District","District","District","District","District","District","District","District","District","District","District","District"]
[null,null,"Grant","Fund",null,"Equipment","Bursaries","Technology","Funds","Entities","Start","Learn","OLEP","CommunityLINK","Fund - Overhead","Fund - Staffing","Fund - Remedies","Transportation","in Schools","Young Children","& Safety Grant","Ventilation Fund","Kindergarten","Credit Program","Affordability","B4","Kindergarten)","& Learning","Fund","Expansion","Entered","Entered","Entered","Entered","Entered","Entered","Entered","Entered","Entered","Entered","Entered","Entered","Entered","Entered","Entered","TOTAL"]
[null,null,"$","$","$","$","$","$","$","$","$",null,"$","$","$","$","$","$","$","$","$","$","$","$","$","$","$","$","$","$","$","$","$","$","$","$","$","$","$","$","$","$","$","$","$","$"]
["Deferred Revenue, beginning of year",null,null,null,null,null,null,null,null,null,null,null,null,null,null,null,null,null,null,null,null,null,null,null,null,null,null,null,null,null,null,null,null,null,null,null,null,null,null,null,null,null,null,null,null,{"$f":"SUM(C9:AS9)","v":0},{"$f":"IF(A68>0,\"ERROR - See below\",\"\")","v":""}]
[]
{"$rows_left_out":78}
{"sheet":"Schedule 4","index":16,"n_rows":92,"n_cols":6,"rows_kept":92,"cut":false,"hidden":false,"merged":[[0,0,0,4],[1,0,1,4],[2,0,2,4],[62,0,62,5],[67,1,67,5],[89,1,89,5],[85,1,85,5],[86,1,86,5],[64,1,64,5],[4,1,4,3],[70,1,70,5],[79,1,79,5],[82,1,82,5],[76,1,76,5],[73,1,73,5]]}
[{"$f":"Cover!B16","v":"School District No. "}]
[{"$f":"Cover!B14&\" - Capital Revenue and Expense\"","v":"Annual Budget - Capital Revenue and Expense"}]
[{"$f":"\"Year Ended \"&Cover!B18","v":"Year Ended June 30, 2025"}]
[]
[null,{"$f":"RIGHT(Cover!$B$18,4)&\" \"&Cover!B14","v":"2025 Annual Budget"}]
[null,"Invested in Tangible","Local","Fund",{"$f":"IF(CompCh=1,\"Please Select\",IF(CompCh=2,Variables!$C$2 &\" \" &Variables!$A$12,IF(Cover!$B$14=\"Annual Budget\",Variables!$C$2,Variables!$D$2)))","v":"Please Select"}]
[null,"Capital Assets","Capital","Balance",{"$f":"IF(CompCh=1,\"Prior Year Source\",Variables!$A$13)","v":"Prior Year Source"}]
[null,"$","$","$","$"]
["Revenues"]
["Provincial Grants"]
{"$rows_left_out":82}