{"text_format":"1","workbook":"xlsx","n_sheets":6,"sheets":["POLE CAPACITY PROGRAM","USER GUIDE","PROGRAM ASSUMPTIONS","POLES DATA","DEFLECTION","MACRO1"],"not_rendered":{"charts":0,"images":0,"macros":0,"external_links":0,"defined_names":85,"comments":5,"pivot_tables":0},"unopened":[],"bounds":{"document_bytes":16777216,"sheet_cells":100000,"rows_first":2000,"rows_last":500,"rows_between":2000,"halvings":0,"cell_chars":16384,"cell_head_chars":4096},"cells_cut":0,"cells_raw":0,"read":"whole","date_system":"1900"}

{"sheet":"POLE CAPACITY PROGRAM","index":0,"n_rows":176,"n_cols":81,"rows_kept":176,"cut":false,"hidden":false,"merged":[]}
[null,null,null,null,null,"POLE CAPACITY PROGRAM",null,null,null,null,"by W. Szto   Release - version Jul 2012",null,null,null,null,null,null,null,null,null,null,null,"POLE SHAFT PULL DOWN MENU, Added by Carl Wong",null,null,null,null,null,"TABLE, ADDED BY CARL WONG"]
["GENERAL",null,null,null,null,null,null,null,null,null,null,null,null,"[UPDATED BY CARL WONG, NOVEMBER 2010, TIAN WANG, JUNE 2012]",null,null,null,null,null,null,null,null,"T1","2A",null,null,null,null,"TOTAL POLE HEIGHT"]
[null,null,null,"PROJECT DESIGNER:",null,null,null,null,"COMPANY NAME:",null,null,null,null,null,null,null,null,null,null,null,null,null,"T3","2C"]
[null,null,null,"PROJECT LOCATION:",null,null,null,null,"PROJECT CITY:",null,null,null,null,null,null,null,null,null,null,null,null,null,"T6",null,null,null,null,null,"POLE SHAFT",null,{"$f":"VLOOKUP($A$10,'POLES DATA'!$A$81:$J$89,4,FALSE)","v":{"$error":"#N/A"}}]
[null,null,null,"PROJECT NO.:",null,null,null,null,"DRAWING NO.:",null,null,null,null,null,null,null,null,null,null,null,null,null,"T7",null,null,null,null,null,"LUMINAIRE EXTENSION",null,{"$f":"IF($A$12<>0,VLOOKUP($A$12,'POLES DATA'!$A$17:$J$77,4,FALSE),)","v":0}]
[null,null,null,"DATE:",{"$f":"NOW()","v":"2023-09-20T14:35:06.820"},null,null,null,"POLE NO.:",null,null,null,null,null,null,null,null,null,null,null,null,null,"L",null,null,null,null,null,"LUMINAIRE",null,2500]
[null,null,null,null,null,null,null,null,null,null,null,null,null,null,null,null,null,null,null,null,null,null,"M",null,null,null,null,null,"TOTAL HEIGHT",null,{"$f":"SUM(AE4:AE6)","v":{"$error":"#N/A"}}]
["WIND PRESSURE =",null,null,null,100,"PASCALS",null,null,null,null,"COMBINED FORCE RATIOS",null,null,null,null,null,null,null,null,null,null,null,"S"]
["POLES",null,null,null,null,null,null,null,null,null,"  BOTTOM OF POLE",null,{"$f":"IF(ISERROR($G$87),\" \",G87)","v":" "},null,null,null,null,null,null,null,null,null,"H"]
[null,"POLE SHAFT                 -",null,null,null,"T1, T3, T6, T7, S, L, M, H",null,null,null,null,"    ANCHOR BOLTS ",null,{"$f":"IF(ISERROR(R85),\"\",R85)","v":""}]
[null,"LUMINAIRE ARM              -",null,null,null,{"$f":"IF(LEN($A$10)=0,\" \",VLOOKUP($A$10,'POLES DATA'!$A$4:$J$12,2,FALSE))","v":" "},null,null,null,null,null,"  ARM  ",{"$f":"IF(ISERROR(G98),\"\",G98)","v":""}]
[null,"LUMINAIRE ARM EXTENSION    - ",null,null,null,{"$f":"IF(LEN($A$10)=0,\" \",VLOOKUP($A$10,'POLES DATA'!$A$4:$J$12,3,FALSE))","v":" "},null,null,null,null,"    FLANGE BOLTS",null,{"$f":"IF($A$10=\"S\",IF(ISERROR($P$109),\"\",$P$109),IF(ISERROR($P$98),\"\",$P$98))","v":""}]
["SIGNAL ARMS",null,null,null,null,null,null,null,null,null,"     TOP OF POLE",null,{"$f":"IF(OR(OR(OR(A10=\"T1\",A10=\"T3\"),A10=\"T6\"),A10=\"T7\"),\"N/A\",IF(ISERROR(I85),\"\",I85))","v":""},null,null,null,null,null,null,null,null,null,"TABLE, ADDED BY CARL WONG"]
[null,"FOR T1,T3,T6,T7,L, M & S",null,null,null,null,null,null,null,null,"Highlighted cells:RATIO>1.00 NO GOOD",null,null,null,null,"SUPERCEDED",null,null,null,null,null,null,"ARM LENGTH CALC.",null,"SIGNAL ARM","SIGN ARM","LARGE RADIUS CHECK","SMALL. RADIUS","THK CHECK"]
[null,"SIGNAL ARM ADAPTOR         -",null,null,null,{"$f":"IF(LEN($A$10)=0,\" \",VLOOKUP($A$10,'POLES DATA'!$A$4:$J$12,6,FALSE))","v":" "},null,null,null,null,null,null,null,null,null,{"$f":"IF(A15=0,0,0.3)","v":0},"(FOR ",null,null,null,null,null,"SIGNAL ARM ADAPTOR",null,{"$f":"IF($A$15<>0,VLOOKUP($A$15,'POLES DATA'!$A$17:$J$77,3,FALSE),0)","v":0},null,{"$f":"IF($A$15=\"\",\"\",VLOOKUP($A$15,'POLES DATA'!$A$17:$J$77,9,FALSE)/2)","v":""},{"$f":"IF($A$15=\"\",\"\",VLOOKUP($A$15,'POLES DATA'!$A$17:$J$77,10,FALSE)/2)","v":""},{"$f":"IF(AND($E$18<>0,$A$15<>0),VLOOKUP($A$15,'POLES DATA'!$A$17:$J$77,8,FALSE),\"\")","v":""}]
[null,"SIGNAL ARM EXTENSION       -",null,null,null,{"$f":"IF(LEN($A$10)=0,\" \",VLOOKUP($A$10,'POLES DATA'!$A$4:$J$12,5,FALSE))","v":" "},null,null,"APPROXIMATE DEAD LOAD DEFLECTIONS",null,null,null,null,null,null,{"$f":"IF(A16=\"3LE\",3,IF(A16=0,0,IF(A16=\"6M\",6,IF(A16=\"7A\",0.24,IF(A16=\"7B\",1.8,IF(A16=\"7C\",2.5,4.8))))))","v":0},"(SIGNAL",null,null,null,null,null,"SIGNAL ARM EXTENSION",null,{"$f":"IF($A$16<>0,VLOOKUP($A$16,'POLES DATA'!$A$17:$J$77,3,FALSE),0)","v":0},null,{"$f":"IF($A$16=\"\",\"\",VLOOKUP($A$16,'POLES DATA'!$A$17:$J$77,9,FALSE)/2)","v":""},{"$f":"IF($A$16=\"\",\"\",VLOOKUP($A$16,'POLES DATA'!$A$17:$J$77,10,FALSE)/2)","v":""},{"$f":"IF(AND($E$18<>0,$A$15=0,$A$16<>0),VLOOKUP($A$16,'POLES DATA'!$A$17:$J$77,8,FALSE),\"\")","v":""},{"$f":"IF(OR($A$16=\"6M\",$A$16=\"3LE\"),\"**\",)","v":0}]
[null,"SIGNAL ARM                 -",null,null,null,{"$f":"IF(LEN($A$10)=0,\" \",IF(OR($A$16=\"3LE\",$A$16=\"6M\"),VLOOKUP($A$10,'POLES DATA'!$A$4:$J$12,9,FALSE),VLOOKUP($A$10,'POLES DATA'!$A$4:$J$12,4,FALSE)))","v":" "},null,null,null,null,"OWN WT.","WITH SIGNALS/SIGNS",null,null,null,{"$f":"IF(A17=\"3L\",3,IF(A17=\"4L\",4,IF(A17=\"5L\",5,IF(A17=\"6L\",6,IF(A17=\"7L\",7,IF(A17=\"8L\",8,IF(A17=\"9L\",9,IF(A17=\"10L\",10,0))))))))","v":0},"(ARM",null,null,null,null,null,"SIGNAL ARM",null,{"$f":"IF($A$17<>0,VLOOKUP($A$17,'POLES DATA'!$A$17:$J$77,3,FALSE),0)","v":0},null,{"$f":"IF($A$17=\"\",\"\",VLOOKUP($A$17,'POLES DATA'!$A$17:$J$77,9,FALSE)/2)","v":""},{"$f":"IF($A$17=\"\",\"\",VLOOKUP($A$17,'POLES DATA'!$A$17:$J$77,10,FALSE)/2)","v":""},{"$f":"IF(AND($E$18<>0,$A$15=0,$A$16=0,$A$17<>0),VLOOKUP($A$17,'POLES DATA'!$A$17:$J$77,8,FALSE),\"\")","v":""}]
[null,"TOTAL ARM REACH =",null,null,{"$f":"$Y$24","v":0},{"$f":"IF(AND($E$18<>0,$E$23<>0),\"ARM CONFLICT\",\"\")","v":""},null,null,"TOP OF POLE(HORI.)",null,{"$f":"IF(ISERROR(DEFLECTION!$C$49),\"\",DEFLECTION!$C$49)","v":""},{"$f":"IF(ISERROR(DEFLECTION!$C$69),\"\",DEFLECTION!$C$69)","v":""},null,null,null,{"$f":"IF(A17=\"11L\",11,IF(A17=\"12L\",12,IF(A17=\"13L\",13,IF(A17=\"14L\",14,0))))","v":0},"(CALCULATION"]
["SIGN ARMS",null,null,null,null,null,null,null,"END OF ARM (VERT.)",null,{"$f":"IF(ISERROR(DEFLECTION!$C$50),\"\",DEFLECTION!$C$50)","v":""},{"$f":"IF(ISERROR(DEFLECTION!$C$71),\"\",DEFLECTION!$C$71)","v":""},null,null,null,{"$f":"IF(A17=0,0,IF(A17=\"3A\",3,IF(A17=\"3C\",1.8,IF(A17=\"3D\",4.3,5.5))))+2.5","v":2.5},null,null,null,null,null,null,"POLE SHAFT ARM",null,{"$f":"IF($A$17=0,0,VLOOKUP($A$10,'POLES DATA'!$A$81:$J$89,3,FALSE))","v":0},{"$f":"IF($A$22=0,0,VLOOKUP($A$10,'POLES DATA'!$A$81:$J$89,3,FALSE))","v":0},null,null,null,"(FOR T1, T3, T6, T7 ONLY)"]
[null,"FOR T1,T3,T6,T7,L,M, H & S",null,null,null,null,null,null,null,null,"DEFLECTION > 600 IS NOT ACCEPTABLE",null,null,null,null,null,null,null,null,null,null,null,"SIGN ARM EXTENSION - INPUT",null,null,{"$f":"IF(OR($A$21=\"LS\", $A$21=\"SS\"),$I$21*10^3,0)","v":0},null,null,null,"(FOR LS & SS ONLY, OTHERWISE ZERO)"]
[null,"SIGN ARM EXTENSION         -",null,null,null,{"$f":"IF(LEN($A$10)=0,\" \",VLOOKUP($A$10,'POLES DATA'!$A$4:$J$12,8,FALSE))","v":" "},null,"LENGTH =",null,"(FOR LS & SS ONLY - USE 3SS, 4SS, 5SS FOR NOW)",null,null,null,null,null,{"$f":"IF(A22=0,0,IF(A21=\"7A\",I22+0.25+2.5,IF(A21=\"7B\",I22+1.8+2.5,IF(A21=\"7C\",I22+2.5+2.5,IF(A21=\"7D\",I22+4.8+2.5,I21+I22)))))","v":0},"(FOR SIGN ARM",null,null,null,null,null,"SIGN ARM EXTENSION - LOOKUP",null,null,{"$f":"IF($A$21<>0,VLOOKUP($A$21,'POLES DATA'!$A$17:$J$77,3,FALSE),0)","v":0},{"$f":"IF($A$21=\"\",\"\",VLOOKUP($A$21,'POLES DATA'!$A$17:$J$77,9,FALSE)/2)","v":""},{"$f":"IF($A$21=\"\",\"\",VLOOKUP($A$21,'POLES DATA'!$A$17:$J$77,10,FALSE)/2)","v":""},{"$f":"IF(AND($E$23<>0,$A$21<>0),VLOOKUP($A$21,'POLES DATA'!$A$17:$J$77,8,FALSE),\"\")","v":""}]
[null,"SIGN ARM                   - ",null,null,null,{"$f":"IF(LEN($A$10)=0,\" \",VLOOKUP($A$10,'POLES DATA'!$A$4:$J$12,7,FALSE))","v":" "},null,"LENGTH =",null,"(FOR L, L1, L2,M1, M2, H1 & H2 ONLY)",null,null,null,null,null,{"$f":"IF(A22=0,0,IF(A21=\"7A\",1.2+0.25+2.5,IF(A21=\"7B\",1.2+1.8+2.5,IF(A21=\"7C\",1.2+2.5+2.5,IF(A22=\"LB\",1.2+I21,I22+I21)))))","v":0},"(CALCULATION",null,null,null,null,null,"SIGN ARM - LOOKUP",null,null,{"$f":"IF($A$22<>0,VLOOKUP($A$22,'POLES DATA'!$A$17:$J$77,3,FALSE),0)","v":0},{"$f":"IF($A$22=\"\",\"\",VLOOKUP($A$22,'POLES DATA'!$A$17:$J$77,9,FALSE)/2)","v":""},{"$f":"IF($A$22=\"\",\"\",VLOOKUP($A$22,'POLES DATA'!$A$17:$J$77,10,FALSE)/2)","v":""},{"$f":"IF(AND($E$23<>0,$A$21=0,$A$22<>0),VLOOKUP($A$22,'POLES DATA'!$A$17:$J$77,8,FALSE),\"\")","v":""}]
[null,"TOTAL ARM REACH = ",null,null,{"$f":"$Z$24","v":0},{"$f":"IF(AND($E$18<>0,$E$23<>0),\"ARM CONFLICT\",\"\")","v":""},null,null,null,"(FOR L,MAX.LENGTH=1.20)",null,null,null,null,null,null,null,null,null,null,null,null,"SIGN ARM - INPUT",null,null,{"$f":"IF(OR($A$22=\"L\", $A$22=\"L1\",$A$22=\"L2\",$A$22=\"M1\", $A$22=\"M2\",$A$22=\"H1\",$A$22=\"H2\"), $I$22*10^3, 0)","v":0},null,null,null,"(FOR L, L1, L2, M1, M2, H1 & H2 ONLY)"]
["SIGNAL HEADS",null,null,null,null,null,null,null,null,null,null,null,null,null,null,null,null,null,null,null,null,null,"TOTAL ARM REACH = ",null,{"$f":"SUM(Y15:Y23)/10^3","v":0},{"$f":"SUM(Z15:Z23)/10^3","v":0}]
[null,"SIGNAL HEAD(S) WITH BACKBOARD (200-200-200)",null,null,null,null,null,null,"SPAN =",null,"SPAN =",null,"SPAN ="]
[null,"SIGNAL HEAD(S) WITH BACKBOARD (300-200-200)",null,null,null,null,null,null,"SPAN =",null,"SPAN =",null,"SPAN ="]
[null,"SIGNAL HEAD(S) WITH BACKBOARD (300-200-200-300)",null,null,null,null,null,null,"SPAN =",null,"SPAN =",null,"SPAN ="]
[null,"SIGNAL HEAD(S) WITH BACKBOARD (300-300-300)",null,null,null,null,null,null,"SPAN =",null,"SPAN =",null,"SPAN ="]
[null,"SIGNAL HEAD(S) WITH BACKBOARD (300-300-300-300)",null,null,null,null,null,null,"SPAN =",null,"SPAN =",null,"SPAN ="]
["SIGNS"]
[null,null,"WIDTH =",null,"HEIGHT =",null,"SPAN =",null,"NO. OF LUMINAIRES PER SIGN ="]
[null,null,"WIDTH =",null,"HEIGHT =",null,"SPAN =",null,"NO. OF LUMINAIRES PER SIGN ="]
[null,null,"WIDTH =",null,"HEIGHT =",null,"SPAN =",null,"NO. OF LUMINAIRES PER SIGN ="]
[]
[]
[null,"POLE DESIGN USING ONTARIO BRIDGE DESIGN CODE (1991)",null,null,null,null,null,null,null,null,null,null,null,null,null,null,null,null,null,null,null,null,null,null,null,null,null,null,null,null,null,null,"TABLE VALUES FROM THIS TABLE WERE NOT CALLED-UP IN FINAL CALCULATION"]
[null,"===================================================",null,null,null,null,null,null,null,null,null,null,null,null,null,null,null,null,null,null,null,null,null,null,null,null,null,null,null,null,null,null,"THIS TABLE WAS INTENDED FOR POLE TYPES T1, T3, T6, T7 (SIGNAL/SIGN ARMS START AT 2.5M AWAY FROM CENTRE OF POLE)"]
[null,"POLE :",null,{"$f":"$A$10","v":0},null,"(H,M or L)",null,"    LOCATION :",null,"STANDARD",null,null,null,null,null,null,null,null,{"$f":"NOW()","v":"2023-09-20T14:35:06.820"},null,null,null,null,null,null,null,null,null,null,null,null,null,"POLE :",null,{"$f":"$A$10","v":0},null,"(H,M or L)",null,"    LOCATION :",null,"STANDARD",null,null,null,null,null,null,null,null,{"$f":"NOW()","v":"2023-09-20T14:35:06.820"}]
[]
[null,"WIND PRESSURE =",null,null,null,{"$f":"$E$8/1000","v":0.1},"KPa(1/50)","Fy =",300,"MPa","18000/Fy=",{"$f":"18000/I40","v":60},null,null,null,null,null,null,null,null,null,null,null,null,null,null,null,null,null,null,null,null,"WIND PRESSURE =",null,null,null,{"$f":"$E$8/1000","v":0.1},"KPa(1/50)","Fy =",300,"MPa","18000/Fy=",{"$f":"18000/AN40","v":60}]
{"$rows_left_out":137}
{"sheet":"USER GUIDE","index":1,"n_rows":50,"n_cols":11,"rows_kept":50,"cut":false,"hidden":false,"merged":[]}
["POLE CAPACITY PROGRAM USER GUIDE",null,null,null,null,null,null,null,null,null,"[EDITED]"]
[]
["REFERENCES"]
["-","Standard Specifications for Highway Construction, BCMoT"]
["-","Electrical and Signing Material Standards, BCMoT"]
[]
["GENERAL"]
["-","Press \"Control A\" to clear all input cells "]
["-","Use UPPERCASE only (lowercase will induce wrong results)"]
["-","Enter general information (optional)"]
[]
["WIND PRESSURE"]
["-","Enter wind pressure"]
["-","Wind pressure tables for various areas of the Province may be found in"]
[null,"the Moth Electrical and Traffic Engineering Manual or the Canadian Highway Bridge Design Code."]
[null,"CAN/CSA-S6-06"]
["-","If the location is not listed on the tables then use the nearest location listed"]
["-","Use 25 year return period for signal poles and 50 year return period for sign poles"]
[]
["POLES"]
["-","Enter the pole part in column to the left"]
["-","Pole parts are detailed in the current Standard Specifications for Highway Construction"]
[]
["SIGNAL ARMS & SIGN ARMS"]
["- ","Enter the arm parts in column to the left"]
["-","Arm parts are detailed in the current Standard Specifications for Highway Construction"]
[]
["SIGNAL HEADS"]
["-","Enter the number of each type of signal head in the column to the left"]
["-","Enter the span of each signal head (from center of pole to center of signal head in meters) in the"]
[null,"column to the right"]
[]
["SIGNS"]
["-","Enter \"1\" on left column for each sign selected (including street name sign)"]
["-","Enter the sign width, height, span and number of sign luminaires for each sign.  \"Sign spans\" are"]
[null,"measured from the center of the sign to the center of the pole shaft in meters"]
[]
["POLE CAPACITY"]
["-","The program will calculate the combination force ratio for each part of pole.  All parts must be less"]
[null,"than 1.0 or the pole is not acceptable"]
{"$rows_left_out":11}
{"sheet":"PROGRAM ASSUMPTIONS","index":2,"n_rows":71,"n_cols":6,"rows_kept":71,"cut":false,"hidden":false,"merged":[]}
["PROGRAM ASSUMPTIONS"]
[]
["DESIGN CODE"]
["-","Canadian Highway Bridge Design Code, CAN/CSA-S6-06"]
["-","Ontario Highway Bridge Design Code, 3rd edition (1991)"]
["-","Standard Specifications for Structural Supports for Highway Signs, Luminaires and Traffic Signals,"]
[null,"AASHTO (1994)"]
[]
["DESIGN PARAMETERS / ASSUMPTIONS"]
["- ","Wind pressure data used are summarized from page 81 and 82 of CHBDC"]
[null,"    25 years return periods for traffic signal structures"]
[null,"    50 years return periods for sign structures "]
["-","Exposure coefficients as per cl. 3.10.1.3 of CHBDC"]
["-","Gust effect coefficient = 2.5 as per cl. 3.10.1.2 of CHBDC"]
["-","Drag coefficients as per table A3.2.2 of CHBDC"]
[null,"    1.4 for octagonal sections with sharp corners"]
[null,"    1.2 for signs and signals"]
["-","Load cases for wind are 100% normal with 20% transverse or 60% normal with 30% transverse as"]
[null,"per table A3.2.3 of CHBDC"]
["- ","Load combinations for ultimate limit state are 1.0 for dead load with 1.3 for wind load as per "]
[null,"table A3.2.1 of CHBDC"]
["- ","Combined axial compression, flexure and torsion interaction as per cl. 10-24.3 OHBDC "]
["- ","Plastic moment coefficients, Kp are taken from table 1.3.1B(2) AASHTO"]
["- ","Maximum stresses in tubular shapes are taken from table 1.3.1B(3) AASHTO"]
["-","No deduction on wind load area on the arm regardless of area covered by signals or signs "]
["-","Anchor bolts are designed to withstand 120% of the applied loads"]
[]
["DESIGN DATA"]
[]
["SIGNALS"]
["TYPE",null,null,"AREA (m^2)",null,"WEIGHT (kn)"]
["(200-200-200)",null,null,0.55000000000000004,null,0.12]
["(300-200-200)",null,null,0.78,null,0.14000000000000001]
["(300-200-200-300)",null,null,1.01,null,0.2]
["(300-300-300)",null,null,0.9,null,0.18]
["(300-300-300-300)",null,null,1.1399999999999999,null,0.24]
[]
["SIGNS"]
["- ","All signs are assumed to have a unit weight of  0.45 kN/m^2 including mounting hardware "]
[]
{"$rows_left_out":32}
{"sheet":"POLES DATA","index":3,"n_rows":101,"n_cols":13,"rows_kept":101,"cut":false,"hidden":true,"merged":[]}
[1,2,3,4,5,6,7,8,9,10,11,12,13]
["TABLE 1:  COMPONENTS SELECTION - UPDATED NOVEMBER 9, 2009",null,null,null,null,null,null,null,null,null,"Reference Drawings - SP635"]
["TYPES","Luminaire Arm","Luminaire Arm Extension","Signal Arm","Signal Arm Extension","Signal Arm Adapter","Sign Arm","Sign Arm Extension","Special Signal Arm","Notes","Signal Pole","Sign Pole","Condition"]
["T1","2A, 2C","2B","3C, 3A, 3D, 3E","(N/A)","(N/A)","L, LB","(N/A)","(INVALID EXTENSION)","6.5 POLE or 8.5 POLE; 2B for 6.5 POLE only; Signal Arm:  3F-300 to 3000mm max; L max 1200mm","2.1.1","3.1.1"]
["T2","2A, 2C","(N/A)","(N/A)","(N/A)","(N/A)","(N/A)","(N/A)","(INVALID EXTENSION)","(N/A)","2.1.3 / 2.1.5","N/A"]
["T3","(N/A)","(N/A)","3C, 3A, 3D, 3E","(N/A)","(N/A)","L, LB","(N/A)","(INVALID EXTENSION)","L max 1200mm","2.1.7","3.1.3"]
["T6","(N/A)","(N/A)","3C, 3A, 3D, 3E","7A, 7B, 7C, 7D","(N/A)","L, LB","7A, 7B, 7C","(INVALID EXTENSION)","L max 1200mm","2.1.11","3.1.6"]
["T7","2A, 2C","7A, 7B, 7D","3C, 3A, 3D, 3E","7A, 7B, 7C, 7D","(N/A)","L, LB","7A, 7B, 7C","(INVALID EXTENSION)","L max 1200mm","2.1.13","3.1.8"]
["L","2A, 2C","0.25L, 1.75L, 4.25L","3L - 11L","3LE","(N/A)","L, LB / L1, L2","LS, 3LS, 4LS, 5LS","9L - 11L","Input sign arm & arm extension length; L max 1200mm","2.2.1","3.1.10","L, LB"]
["M","2A, 2C","0.25M, 1.75M, 4.25M","3L - 11L","6M","FA","M1, M2","(N/A)","6L - 11L","Sign Arm:  3000 to 11000mm max","2.2.4","3.1.13"]
["H","2A, 2C","1.13H, 3.63H","(N/A)","(N/A)","(N/A)","H1, H2","(N/A)","(INVALID EXTENSION)","Sign Arm: H1-3000 to 8000mm max; H2-3000 to 11000mm max","N/A","3.1.16"]
["S","2A, 2C","0.25L, 1.75L","5S - 11S","(N/A)","(N/A)","L, LB","SS, 3SS, 4SS, 5SS","(INVALID EXTENSION)","Input sign arm & arm extension length; L max 1200mm","2.2.7","3.1.19"]
[]
[]
["TABLE 2:  COMPONENTS PROPERTIES (POLE ARMS)"]
["Sections","Type","Lengths (mm) - horizontal","Height (mm) - vertical","Height of Arm (mm)","Mass (kg)","# of sides","Plate Thk. (mm)","Dia, Max (mm)","Dia, Min (mm)"]
["3C","T1",1800,null,null,18,8,3,120,67]
["3A","T1",3000,null,null,27,8,3,120,67]
["3D","T1",4300,null,null,54,8,4.8,120,67]
["3E","T1",5500,null,null,68,8,4.8,120,67]
["2A","T1",2500,2500,null,35,8,3,120,67]
["2B","T1",null,2000,null,35,8,4.8,120,120]
["2C","T1",5000,2500,null,65,8,3,120,67]
["7A","T6",250,250,null,20,8,4.8,170,120]
["7B","T6",1800,1800,null,69,8,8,170,120]
["7C","T6",2500,null,null,86,8,8,170,120]
["7D","T6",4800,4800,null,154,8,8,170,120]
["H1","H","(INPUT)",null,null,"(INPUT)",12,6.4,340,340]
["H2","H","(INPUT)",null,null,"(INPUT)",12,8,340,340]
["1.13H","H",null,1130,null,36,12,3,350,120]
["3.63H","H",null,3630,null,118,12,4.8,350,120]
["3L","L",3000,null,null,97,8,4.8,220,120]
["4L","L",4000,null,null,118,8,4.8,220,120]
["5L","L",5000,null,null,173,8,6.4,220,120]
["6L","L",6000,null,null,201,8,6.4,220,120]
["7L","L",7000,null,null,229,8,6.4,220,120]
["8L","L",8000,null,null,259,8,6.4,220,120]
["9L","L",9000,null,null,284,8,6.4,220,120]
["10L","L",10000,null,null,377,8,8,220,120]
["11L","L",11000,null,null,410,8,8,220,120]
{"$rows_left_out":62}
{"sheet":"DEFLECTION","index":4,"n_rows":113,"n_cols":135,"rows_kept":113,"cut":false,"hidden":true,"merged":[]}
["APRIL 1995",null,"DEFLECT1.XLW","By P. Wong"]
[]
["This spreadsheet approximates the tip vertical deflection and",null,null,null,null,null,"Calculation Assumptions:"]
["joint horizontal deflection of an inverted-L-shaped sign pole"]
["with an octagonal tube cross section.",null,null,null,null,null,"Each member is divided into equal pieces with uniform sectional properties approximate a tapered post. Note that the largest cross-section is taken for each piece. "]
[]
[null,null,null,null,null,null,"Table 1: Horizontal Deflections at joint. "]
[]
["Material",null,null,null,null,null,"Table 2: Vertical Deflections at tip of cantilever"]
["E","modulus of elasticity",200000,"MPa"]
["G","shear modulus",77000,"MPa",null,null,"Each table is organized into two parts."]
["u","unit weight",7.7000000000000001E-5,"N/mm^3",null,null,"First part calculates deflection caused by each of the 8 types of external weights (5 types of signal heads + 3 types of signage)"]
[null,null,null,null,null,null,"Second Part calculates deflection cuased by the self weight of the post and cantilever"]
["========= GEOMETRY AND LOADING ========="]
["CANTILEVERED POLE",null,null,null,null,null,"Total deflections presented in \"POLE CAPACITY PROGRAM\" sums the deflections from self weight and external loads."]
["RCG","greater radius",{"$f":"'POLE CAPACITY PROGRAM'!$F$71","v":{"$error":"#N/A"}},"mm"]
["RCS","smaller radius",{"$f":"'POLE CAPACITY PROGRAM'!$G$71","v":{"$error":"#N/A"}},"mm",null,null,"Area and Moment of Intertia formulae taken from the design aid sections of AASHTO Standard Specifications for Structural Supports for Highway Signs, Luminaires, and Traffic Signals."]
["t","thickness",{"$f":"'POLE CAPACITY PROGRAM'!$H$71","v":0},"mm"]
["Lc","total length of pole",{"$f":"'POLE CAPACITY PROGRAM'!$E$71*1000","v":0},"mm",null,null,"Spread sheet takes into account of the cross-sectional differences between S and L type (8 sides), to M and H type. (12 sides)."]
["ShpC","Number of sides in cross-section",{"$f":"'POLE CAPACITY PROGRAM'!$F$46","v":8},"sides"]
[null,null,null,null,null,null,"Analysis uses moment area method summing the deflections of each piece"]
["POST"]
["RPG","greater radius",{"$f":"'POLE CAPACITY PROGRAM'!$F$74","v":{"$error":"#N/A"}},"mm",null,null,"Linkage in formulae established to include S type poles."]
["RPS","smaller radius",{"$f":"'POLE CAPACITY PROGRAM'!$G$74","v":{"$error":"#N/A"}},"mm"]
["tp","thickness",{"$f":"'POLE CAPACITY PROGRAM'!$H$74","v":{"$error":"#N/A"}},"mm",null,null,"Bolt capacities updated to comform with S16-01"]
["Lp","height of post (to center of joint)",{"$f":"'POLE CAPACITY PROGRAM'!$E$74*1000","v":{"$error":"#N/A"}},"mm"]
["ShpP","Number of sides in cross-section",{"$f":"'POLE CAPACITY PROGRAM'!$F$45","v":8},"sides",null,null,"Factored shear and tension loads adjusted for flange bolts on S-Type pole to reflect its rectangular bolt pattern"]
[]
["LOADS  (Dead load is automatically calculated)"]
["WW1","point load 1",{"$f":"'POLE CAPACITY PROGRAM'!$K$58*1000","v":0},"N"]
["Ls1","length from joint to load 1",{"$f":"'POLE CAPACITY PROGRAM'!$N$58*1000","v":0},"mm"]
["WW2","point load 2",{"$f":"'POLE CAPACITY PROGRAM'!$K$59*1000","v":0},"N"]
["Ls2","length from joint to load 2",{"$f":"'POLE CAPACITY PROGRAM'!$N$59*1000","v":0},"mm"]
["WW3","point load 3",{"$f":"'POLE CAPACITY PROGRAM'!$K$60*1000","v":0},"N"]
["Ls3","length from joint to load 3",{"$f":"'POLE CAPACITY PROGRAM'!$N$60*1000","v":0},"mm"]
["WW4","point load 4",{"$f":"'POLE CAPACITY PROGRAM'!$K$61*1000","v":0},"N"]
["Ls4","length from joint to load 4",{"$f":"'POLE CAPACITY PROGRAM'!$N$61*1000","v":0},"mm"]
["WW5","point load 5",{"$f":"'POLE CAPACITY PROGRAM'!$K$62*1000","v":0},"N"]
["Ls5","length from joint to load 5",{"$f":"'POLE CAPACITY PROGRAM'!$N$62*1000","v":0},"mm"]
["WW6","point load 6",{"$f":"'POLE CAPACITY PROGRAM'!$K$65*1000+'POLE CAPACITY PROGRAM'!$K$68*1000","v":0},"N"]
{"$rows_left_out":74}
{"sheet":"MACRO1","index":5,"n_rows":38,"n_cols":1,"rows_kept":38,"cut":false,"hidden":true,"merged":[]}
["clean (a)"]
[{"$f":"SELECT(\"R3C5:R5C5\")","v":true}]
[{"$f":"CLEAR(3)","v":true}]
[{"$f":"SELECT(\"R8C5\")","v":true}]
[{"$f":"CLEAR(3)","v":true}]
[{"$f":"SELECT(\"R10C1:R12C1\")","v":true}]
[{"$f":"CLEAR(3)","v":true}]
[{"$f":"SELECT(\"R15C1:R17C1\")","v":true}]
[{"$f":"CLEAR(3)","v":true}]
[{"$f":"VLINE(18)","v":true}]
[{"$f":"SELECT(\"R21C1:R22C1\")","v":true}]
[{"$f":"CLEAR(3)","v":true}]
[{"$f":"SELECT(\"R25C1:R29C1\")","v":true}]
[{"$f":"CLEAR(3)","v":true}]
[{"$f":"SELECT(\"R31C1:R33C1\")","v":true}]
[{"$f":"CLEAR(3)","v":true}]
[{"$f":"SELECT(\"R31C4:R33C4\")","v":true}]
[{"$f":"CLEAR(3)","v":true}]
[{"$f":"SELECT(\"R31C6:R33C6\")","v":true}]
[{"$f":"CLEAR(3)","v":true}]
[{"$f":"SELECT(\"R31C8:R33C8\")","v":true}]
[{"$f":"CLEAR(3)","v":true}]
[{"$f":"HLINE(8)","v":true}]
[{"$f":"SELECT(\"R31C12:R33C12\")","v":true}]
[{"$f":"CLEAR(3)","v":true}]
[{"$f":"SELECT(\"R25C14:R29C14\")","v":true}]
[{"$f":"CLEAR(3)","v":true}]
[{"$f":"SELECT(\"R25C12:R29C12\")","v":true}]
[{"$f":"CLEAR(3)","v":true}]
[{"$f":"SELECT(\"R25C10:R29C10\")","v":true}]
[{"$f":"CLEAR(3)","v":true}]
[{"$f":"SELECT(\"R21C9:R22C9\")","v":true}]
[{"$f":"CLEAR(3)","v":true}]
[{"$f":"VLINE(-18)","v":true}]
[{"$f":"SELECT(\"R3C10:R6C10\")","v":true}]
[{"$f":"CLEAR(3)","v":true}]
[{"$f":"SELECT(\"R1C1\")","v":true}]
[{"$f":"RETURN()","v":true}]