{"text_format":"1","workbook":"xlsx","n_sheets":7,"sheets":["Form","Ops Centre Guide ","Address Lookup","Report","WSI Info","Process Checklist","Tables"],"not_rendered":{"charts":0,"images":6,"macros":1,"external_links":0,"defined_names":8,"comments":0,"pivot_tables":0},"unopened":[],"bounds":{"document_bytes":16777216,"sheet_cells":100000,"rows_first":2000,"rows_last":500,"rows_between":2000,"halvings":0,"cell_chars":16384,"cell_head_chars":4096},"cells_cut":0,"cells_raw":0,"read":"whole","date_system":"1900"}

{"sheet":"Form","index":0,"n_rows":75,"n_cols":4,"rows_kept":75,"cut":false,"hidden":false,"merged":[[45,1,45,3],[46,1,46,3],[56,1,56,3],[9,1,9,3],[10,1,10,3],[43,1,43,3],[51,1,51,3],[52,1,52,3],[54,1,54,3],[47,1,47,3],[72,1,72,3],[60,1,60,3],[49,1,49,3],[58,1,58,3],[57,1,57,3],[59,1,59,3],[68,1,68,3],[53,1,53,3],[65,1,65,3],[66,1,66,3]]}
[]
[null,null,null,"REFERENCE NUMBER:"]
[null,null,null,{"$f":"IF(ISBLANK(D5),\"\",YEAR(D5)&\"-\"&MONTH(D5)&\"-\"&DAY(D5)&\"_\"&D38&\"_\"&B17)","v":""}]
[null,null,null,"* Submission Date (yyyy-mm-dd):"]
[]
[null,null,null,"Request Status:"]
[null,"TIER 2 SERVICE COMPLAINT ESCALATION FORM",null,"New"]
[]
[null,"Please read prior to submitting a Tier 2 Form:"]
[null,"The use of this form is to identify service deficiencies related to the resolution of Service Complaints (SC) submitted to the WSI Operation Centre.  \nPlease use this form only after you’ve raised a Service Complaint (Tier 1) with the WSI Operations Centre and are not satisfied with the result. \nYou will need to include the following information in order for us to process your escalation:\n• Service Complaint BCB Tracking # and associated work order number(s) from WSI.\n• All emails and documents related to the issue.\nFor more information on submitting Service Complaints (Tier 1), please refer to the worksheet tab labelled Ops Centre Guide.\n"]
[null,"Upon completion the form will be assigned a RPD reference number.  \nYou will be contacted within two business days by a RPD Contract Performance Officer (CPO) regarding your issue.  The CPO will work with WSI to resolve your issue updating\nyou as progress is made. Once resolution is determined, detailed notes will be added to your initial submission and you will receive a copy of the completed form along with an email advising you of the Resolved status seeking your concurrence to advance the issue to Closed status."]
[]
[null,"Enter data into light blue fields, * indicates a mandatory field, please complete all * fields prior to submitting the form. "]
[]
[null,"WSI Work Order Information:"]
[null,"* Service Complaint # (e.g. BCB12345678)","Other Work Order #'s (e.g. BCB12345678, BCB23456789, ...)","* Multiple requests or complaints issued (Yes/No)"]
[]
[]
[null,"* Service Deficiency (Primary - select one)","Service Deficiency (Secondary - select one)","Service Deficiency Other (manual entry)"]
[]
[]
[null,"* Impact (Primary - select one)","Impact (Secondary - select one)","Impact Other (manual entry)"]
[]
[]
[null,"Facilities Key Contact Information:"]
[null,"* Name","* Telephone #","* Email address"]
[]
[]
[null,"Parent Org / Ministry name (select one)","Branch / Child Org (select one)","Other Organization / Program Name (manual entry)"]
[]
[null,"Client On-Site Contact Information (if applicable):"]
[null,"Name","Telephone #","Email address"]
[]
[]
[]
[null,"Building information:"]
[null,"* Building Address (select one)","Building Number (auto populates with address selection)","City (auto populates with address selection)"]
[null,null,{"$f":"IFERROR(VLOOKUP(B38,'Address Lookup'!$A$1:$F$1579,3,FALSE),\"\")","v":""},{"$f":"IFERROR(VLOOKUP(B38,'Address Lookup'!$A$1:$F$1579,5,FALSE),\"\")","v":""}]
[]
[null,"Tenure (auto populates with address selection)","Floor # ","Suite # "]
[null,{"$f":"IFERROR(VLOOKUP(B38,'Address Lookup'!$A$1:$F$1579,4,FALSE),\"\")","v":""}]
[]
[null,"* Description of issue (1000 character max):"]
[]
[]
[null,"The use of this form is to identify service deficiencies related to the resolution of Service Complaints submitted to the WSI Operation Centre."]
[null,"Definitions: A Service Complaint may be referred to as an SC. A Service Request may be referred to as an SR. A Work Order may be referred to as a WO."]
[null,"For additional information and resources for submitting and tracking SR's and SC's please refer to worksheet tab labelled Ops Centre Guide or the following link:"]
[null,"WSI Operations Centre Guide"]
[]
[null,"Saving, adding attachments and submitting:"]
[null,"1. Upon completion of all mandatory form fields save the form to your preferred location/file on your computer."]
[null,"2. Click on the email hyperlink FMS CPO Mailbox below and an email message will open with the subject line pre-populated.  Please do not edit the subject line."]
[null,"3. Attach the Tier2 form to the email.  Attach any other relevant documents and/or add supporting information to the body of the email."]
[null,"4. Send the email to the FMS CPO Mailbox to finalize the submission of the form."]
[]
[null,"Upon submitting the email, the form is sent directly to the Facilities Management Services Branch (FMS) of Real Property Division (RPD) for action."]
[]
[null,"You will be contacted within two business days by an FMS Contract Performance Officer (CPO) regarding your issue.  \nOnce resolution is determined, detailed notes will be added to your initial submission and you will receive a copy of the completed form along with an email advising you whether the status of the issue has advanced to Closed."]
[null,"Should you experience issues with the form or have questions regarding the process please email RPD at:"]
{"$rows_left_out":16}
{"sheet":"Ops Centre Guide ","index":1,"n_rows":0,"n_cols":0,"rows_kept":0,"cut":false,"hidden":false,"merged":[]}

{"sheet":"Address Lookup","index":2,"n_rows":1579,"n_cols":6,"rows_kept":1579,"cut":false,"hidden":false,"merged":[]}
["Address","Description","Building","Tenure","City","Contract Performance Officer"]
[" Suite 506 - 55 City Centre Dr.","Mississauga Ontario Office","B1002517","Leased","MISSISSAUGA"]
["#6 Federal Way","RCMP Sewage Treatment Building","B1002340","Managed","NEW AIYANSH","Elena Awchoula"]
["1 - 361 Trans Canada Hwy","Kidney Dialysis Clinc ","B1002345","Leased","DUNCAN","Allison Dunn"]
["1 Cicada Rd.","District Office","B0067242","Leased","MACKENZIE","Carolynn Oliver"]
["1 Cicada Rd.","Shed - Implements   (L2913)","B0078087","Leased","MACKENZIE","Carolynn Oliver"]
["1 Cicada Rd.","Fuel Shed  (L2913)","B0078088","Leased","MACKENZIE","Carolynn Oliver"]
["1 Cicada Rd.","Double Wide Trailer - District Office","B1002620","Owned","MACKENZIE","Carolynn Oliver"]
["1 Clearwater Pl.","RCMP Residence","B0091545","Managed","ELKFORD","Alison Nordgren"]
["1 Coast Guard Rd. - Seal Cove","RCMP Seal Cove Hangar","B0091332","Managed","PRINCE RUPERT","Elena Awchoula"]
["1 Lots 1 & 2","R.C.M.P.","B0090928","Managed","GIBSONS","Davy Mulligan"]
["1 Sawtooth Road - B","R.C.M.P. Residence - Eo434","B0092451","Managed","TELEGRAPH CREEK","Elena Awchoula"]
["1 Tanzilla Pl.","House - Residence","B0049999","Owned","DEASE LAKE","Elena Awchoula"]
["100 Cranbrook St. N.","Access Ctr","B0067516","Leased","CRANBROOK","Alison Nordgren"]
["100 Main St.","Courthouse/Office","B0022236","Owned","PENTICTON","Alison Nordgren"]
["100 Market Pl.","Courthouse/Office","B0040295","Owned","PRINCE RUPERT","Elena Awchoula"]
["10003 110th Ave.","Frances Work Beaton Building","B0092433","Leased","FORT ST. JOHN","Carolynn Oliver"]
["10004 Dudley Dr.","Residence","B0091272","Managed","HUDSON'S HOPE","Carolynn Oliver"]
["1001 110th Ave.","Health Ctr","B0078129","Owned","DAWSON CREEK","Carolynn Oliver"]
["1001 Douglas St.","Sussex","B0067621","Leased","VICTORIA","Darrel Murphy"]
["10011 - 96th Ave.","NHA Space","B1002292","Managed","FORT ST. JOHN","Carolynn Oliver"]
["1002 Teal St.","R.C.M.P Residence","B0092452","Managed","CLINTON","Mark Timmins"]
["10043 100th St.","Office","B0092593","Leased","FORT ST. JOHN","Carolynn Oliver"]
["10095 Whalley Blvd. ","Office","B0092263","Leased","SURREY","Joel Guno"]
["1010 2nd St.","R.C.M.P. District Bldg","B0091553","Managed","NELSON","Alison Nordgren"]
["1010 Mackenzie Ave.","Storage - Pesticide","B0078036","Owned","WILLIAMS LAKE","Carolynn Oliver"]
["1010 Mackenzie Ave.","Warehouse","B0082677","Owned","WILLIAMS LAKE","Carolynn Oliver"]
["1010 Mackenzie Ave.","District Warehouse B","B0082685","Owned","WILLIAMS LAKE","Carolynn Oliver"]
["1010 Mackenzie Ave.","Refrigeration","B0082693","Owned","WILLIAMS LAKE","Carolynn Oliver"]
["1010 Mackenzie Ave.","Oil Storage Shed","B0082701","Owned","WILLIAMS LAKE","Carolynn Oliver"]
["1010 Mackenzie Ave.","Storage","B0082727","Owned","WILLIAMS LAKE","Carolynn Oliver"]
["1010 Mackenzie Ave.","Cone Shed","B0082743","Owned","WILLIAMS LAKE","Carolynn Oliver"]
["10103 13th St.","Office - Field Operations","B0067279","Leased","DAWSON CREEK","Carolynn Oliver"]
["10105 MacIntosh Cres.","Residence","B0091273","Managed","HUDSON'S HOPE","Carolynn Oliver"]
["1011 4th Ave.","Plaza 400 - Incl Access Ctr","B0043406","Leased","PRINCE GEORGE","Carolynn Oliver"]
["10113 MacIntosh Cres.","Residence","B0091274","Managed","HUDSON'S HOPE","Carolynn Oliver"]
["10115 110th Ave.","Health Ctr - 1992","B0078128","Owned","FORT ST. JOHN","Carolynn Oliver"]
["1012 Douglas St","Office Building ","B1002621","Leased","VICTORIA","Darrel Murphy"]
["1015 Columbia St.","Bldg \"K\" Col. Sq Plaza","B0067723","Leased","NEW WESTMINSTER","Davy Mulligan"]
["1017 Miller Rd.","R.C.M.P. Detachment","B0090926","Managed","BOWEN ISLAND","Davy Mulligan"]
["10193 152a St.","Office","B0092571","Leased","SURREY","Joel Guno"]
["102 11th Ave. S.","Courthouse","B0034512","Owned","CRANBROOK","Alison Nordgren"]
["102 Industrial Pl.","Letts Properties Bldg ","B0065326","Leased","PENTICTON","Alison Nordgren"]
["102 Industrial Pl.","Co Storage/Workshop  (L2373)","B0078048","Leased","PENTICTON","Alison Nordgren"]
["102 Industrial Pl.","Warehouse  (L2373)","B0092228","Leased","PENTICTON","Alison Nordgren"]
["102 Industrial Pl.","Fuel Shed (L2373)","B0092245","Leased","PENTICTON","Alison Nordgren"]
["1020 Murray St.","Access Ctr  ","B0092162","Leased","SMITHERS","Elena Awchoula"]
["1021 2nd Ave.","R.C.M.P. RESIDENCE","B1002623","Managed","QUEEN CHARLOTTE","Elena Awchoula"]
["1021 Miller Rd.","R.C.M.P.  House","B0090936","Managed","BOWEN ISLAND","Davy Mulligan"]
["10221 153rd St.","Guildford Ctr","B0067325","Leased","SURREY","Joel Guno"]
["102-4450 Greig Ave.","Office","B0091979","Leased","TERRACE","Elena Awchoula"]
["1030 West Georgia St.","OFFICE","B1002244","Leased","VANCOUVER","Davy Mulligan"]
["10317 Gething St.","R.C.M.P. Detachment 50426","B0091313","Managed","HUDSON'S HOPE","Carolynn Oliver"]
["1040 Shopper'S Row","1000 Shopper'S Row","B0065557","Leased","CAMPBELL RIVER","Darrel Murphy"]
["10428 153 St.","Office ","B0092486","Leased","SURREY","Joel Guno"]
["1045 8th Ave.","Residence","B0091331","Managed","VALEMOUNT","Elena Awchoula"]
["10453 Whalley Blvd. ","Office","B0092634","Leased","SURREY","Joel Guno"]
["10470 152nd St.","Office/Warehouse/Lab","B0068147","Leased","SURREY","Joel Guno"]
["10475 138th St.","Office","B0092143","Leased","SURREY","Joel Guno"]
["1048 Hwy. 16 E.","R.C.M.P. Detachment 50176","B0091316","Managed","MCBRIDE","Elena Awchoula"]
{"$rows_left_out":1520}
{"sheet":"Report","index":3,"n_rows":6,"n_cols":32,"rows_kept":6,"cut":false,"hidden":true,"merged":[[5,0,6,0],[0,29,0,31],[0,14,0,19],[0,0,0,2],[0,20,0,22],[0,23,0,28],[0,5,0,13],[0,3,0,4]]}
["Form Information:",null,null,"Update Reference",null,{"$f":"Form!B15","v":"WSI Work Order Information:"},null,null,null,null,null,null,null,null,{"$f":"Form!B25","v":"Facilities Key Contact Information:"},null,null,null,null,null,{"$f":"Form!B31","v":"Client On-Site Contact Information (if applicable):"},null,null,{"$f":"Form!B36","v":"Building information:"},null,null,null,null,null,"Issue and resolution:"]
[{"$f":"Form!D2","v":"REFERENCE NUMBER:"},{"$f":"Form!D4","v":"* Submission Date (yyyy-mm-dd):"},{"$f":"Form!D6","v":"Request Status:"},"Update Date & Time","Building Superintendent",{"$f":"Form!B16","v":"* Service Complaint # (e.g. BCB12345678)"},{"$f":"Form!C16","v":"Other Work Order #'s (e.g. BCB12345678, BCB23456789, ...)"},{"$f":"Form!D16","v":"* Multiple requests or complaints issued (Yes/No)"},{"$f":"Form!B19","v":"* Service Deficiency (Primary - select one)"},{"$f":"Form!C19","v":"Service Deficiency (Secondary - select one)"},{"$f":"Form!D19","v":"Service Deficiency Other (manual entry)"},{"$f":"Form!B22","v":"* Impact (Primary - select one)"},{"$f":"Form!C22","v":"Impact (Secondary - select one)"},{"$f":"Form!D22","v":"Impact Other (manual entry)"},{"$f":"Form!B26","v":"* Name"},{"$f":"Form!C26","v":"* Telephone #"},{"$f":"Form!D26","v":"* Email address"},{"$f":"Form!B29","v":"Parent Org / Ministry name (select one)"},{"$f":"Form!C29","v":"Branch / Child Org (select one)"},{"$f":"Form!D29","v":"Other Organization / Program Name (manual entry)"},{"$f":"Form!B32","v":"Name"},{"$f":"Form!C32","v":"Telephone #"},{"$f":"Form!D32","v":"Email address"},{"$f":"Form!B37","v":"* Building Address (select one)"},{"$f":"Form!C37","v":"Building Number (auto populates with address selection)"},{"$f":"Form!D37","v":"City (auto populates with address selection)"},{"$f":"Form!B40","v":"Tenure (auto populates with address selection)"},{"$f":"Form!C40","v":"Floor # "},{"$f":"Form!D40","v":"Suite # "},{"$f":"Form!B43","v":"* Description of issue (1000 character max):"},{"$f":"Form!B72","v":"Resolution Notes (completed by RPD CPO representative):"},{"$f":"Form!D74","v":"Resolved/Closed Date (yyyy-mm-dd):"}]
[{"$f":"Form!D3","v":""},{"$f":"IF(Form!D5=0,\"\",Form!D5)","v":""},{"$f":"Form!D7","v":"New"},{"$f":"NOW()","v":"2019-10-09T11:21:19.920"},{"$f":"Form!C75","v":{"$error":"#N/A"}},{"$f":"IF(Form!B17=0,\"\",Form!B17)","v":""},{"$f":"IF(Form!C17=0,\"\",Form!C17)","v":""},{"$f":"IF(Form!D17=0,\"\",Form!D17)","v":""},{"$f":"IF(Form!B20=0,\"\",Form!B20)","v":""},{"$f":"IF(Form!C20=0,\"\",Form!C20)","v":""},{"$f":"IF(Form!D20=0,\"\",Form!D20)","v":""},{"$f":"IF(Form!B23=0,\"\",Form!B23)","v":""},{"$f":"IF(Form!C23=0,\"\",Form!C23)","v":""},{"$f":"IF(Form!D23=0,\"\",Form!D23)","v":""},{"$f":"IF(Form!B27=0,\"\",Form!B27)","v":""},{"$f":"IF(Form!C27=0,\"\",Form!C27)","v":""},{"$f":"IF(Form!D27=0,\"\",Form!D27)","v":""},{"$f":"IF(Form!B30=0,\"\",Form!B30)","v":""},{"$f":"IF(Form!C30=0,\"\",Form!C30)","v":""},{"$f":"IF(Form!D30=0,\"\",Form!D30)","v":""},{"$f":"IF(Form!B33=0,\"\",Form!B33)","v":""},{"$f":"IF(Form!C33=0,\"\",Form!C33)","v":""},{"$f":"IF(Form!D33=0,\"\",Form!D33)","v":""},{"$f":"IF(Form!B38=0,\"\",Form!B38)","v":""},{"$f":"IF(Form!C38=0,\"\",Form!C38)","v":""},{"$f":"IF(Form!D38=0,\"\",Form!D38)","v":""},{"$f":"IF(Form!B41=0,\"\",Form!B41)","v":""},{"$f":"IF(Form!C41=0,\"\",Form!C41)","v":""},{"$f":"IF(Form!D41=0,\"\",Form!D41)","v":""},{"$f":"IF(Form!B44=0,\"\",Form!B44)","v":""},{"$f":"IF(Form!B73=0,\"\",Form!B73)","v":""},{"$f":"IF(Form!D75=0,\"\",Form!D75)","v":""}]
[]
[]
["Use this button to submit updated data to the Tier2 database"]

{"sheet":"WSI Info","index":4,"n_rows":27,"n_cols":4,"rows_kept":27,"cut":false,"hidden":true,"merged":[[26,1,26,3],[25,1,25,3],[19,1,19,3],[15,1,15,3],[12,1,12,3]]}
[]
[null,"Tier2 Reference #:",{"$f":"Form!D3","v":""}]
[null,"Submission Date:",{"$f":"IF(Form!D5=0,\"\",Form!D5)","v":""}]
[]
[null,"WSI Work Order Information:"]
[null,"* Service Complaint #","Other WO #'s","* Multiple requests/complaints"]
[null,{"$f":"IF(Form!B17=0,\"\",Form!B17)","v":""},{"$f":"IF(Form!C17=0,\"\",Form!C17)","v":""},{"$f":"IF(Form!D17=0,\"\",Form!D17)","v":""}]
[null,"* Service Deficiency (Primary)","Service Deficiency (Secondary)","Service Deficiency Other"]
[null,{"$f":"IF(Form!B20=0,\"\",Form!B20)","v":""},{"$f":"IF(Form!C20=0,\"\",Form!C20)","v":""},{"$f":"IF(Form!D20=0,\"\",Form!D20)","v":""}]
[null,"* Impact (Primary)","Impact (Secondary)","Impact Other"]
[null,{"$f":"IF(Form!B23=0,\"\",Form!B23)","v":""},{"$f":"IF(Form!C23=0,\"\",Form!C23)","v":""},{"$f":"IF(Form!D23=0,\"\",Form!D23)","v":""}]
[]
[null,{"$f":"Form!B25","v":"Facilities Key Contact Information:"}]
[null,"* Name","* Telephone #","* Email address"]
[null,{"$f":"IF(Form!B27=0,\"\",Form!B27)","v":""},{"$f":"IF(Form!C27=0,\"\",Form!C27)","v":""},{"$f":"IF(Form!D27=0,\"\",Form!D27)","v":""}]
[null,{"$f":"Form!B31","v":"Client On-Site Contact Information (if applicable):"}]
[null,"Name","Telephone #","Email address"]
[null,{"$f":"IF(Form!B33=0,\"\",Form!B33)","v":""},{"$f":"IF(Form!C33=0,\"\",Form!C33)","v":""},{"$f":"IF(Form!D33=0,\"\",Form!D33)","v":""}]
[]
[null,{"$f":"Form!B36","v":"Building information:"}]
[null,"* Address","Building Number ","City "]
[null,{"$f":"IF(Form!B38=0,\"\",Form!B38)","v":""},{"$f":"IF(Form!C38=0,\"\",Form!C38)","v":""},{"$f":"IF(Form!D38=0,\"\",Form!D38)","v":""}]
[null,"Tenure","Floor # ","Suite #"]
[null,{"$f":"IF(Form!B41=0,\"\",Form!B41)","v":""},{"$f":"IF(Form!C41=0,\"\",Form!C41)","v":""},{"$f":"IF(Form!D41=0,\"\",Form!D41)","v":""}]
[]
[null,"* Description of issue (1000 character max):"]
[null,{"$f":"IF(Form!B44=0,\"\",Form!B44)","v":""}]

{"sheet":"Process Checklist","index":5,"n_rows":24,"n_cols":3,"rows_kept":24,"cut":false,"hidden":true,"merged":[]}
["Tier2 CPO Process Checklist"]
[]
[1,null,"Check CPO inbox daily for your area and coverage area if currently applicable."]
[2,null,"Forward submission from CPO inbox to your personal email, copy orginal email with form to Livelink."]
[3,null,"Unprotect form and workbook and unhide hidden tabs.  Update Tier 2 database using submit button on Report tab.  Form status \"New\"."]
[4,null,"Validate request and review work order history.  "]
["5-a",null,"If Tier 2 is invalid contact client ASAP and educate them on Tier 2 process.  Form status \"Cancelled\"."]
["5-b",null,"If Tier 2 is valid, contact client and propose meeting time within 2 business days of receiving Tier 2."]
[6,null,"Notify WSI FM and RD that a Tier 2 has been received and more details will follow after client meeting. (No details shared at this point)"]
[7,null,"Facilitate client meeting and collect requirements, establish update time, update form and set form status to \"In Progress\"."]
[8,null,"Forward updated form to client with copy to client services DCR confirming next update time."]
[9,null,"Update Tier 2 database using submit button on Report tab."]
[10,null,"Set up meeting with WSI providing details from client meeting."]
[11,null,"Work on resolution with WSI, include other participants in issue resolution as required.  Update form as progress is made."]
[12,null,"Update client per established timeframe."]
[13,null,"Once issue resolved update form and set form to \"Resolved\" status."]
[14,null,"Communicate Resolved status to client, forward updated form, copy client services DCR."]
[15,null,"Update Tier 2 database using submit button on Report tab."]
[16,null,"Contact client and confirm issue has been resolved to their satisfaction."]
["17-a",null,"Client IS satisfied, update form and set form to \"Closed\" status, forward to client, copy client services DCR."]
["17-b",null,"Client NOT satisfied, update form, set form to \"In Progress\" and go back to step 9, forward update to client and copy client services DCR."]
["17-c",null,"     or     Client NOT satisfied, escalate to client services DCR and FMS CPM.  Update form status to \"Reviewed and Raised\"."]
[18,null,"File the Final form in Livelink.  Update Tier 2 database using submit button on Report tab."]
[19,null,"Once agreement is made to set the form in \"Closed\" or \"Review and Raised\" or \"Cancelled\" status the TIER2 PROCESS ENDS."]

{"sheet":"Tables","index":6,"n_rows":218,"n_cols":7,"rows_kept":218,"cut":false,"hidden":true,"merged":[]}
["Status","YES/NO","Service Deficiency","Impact","Ministry / Parent Org","Branch / Child Org","CPO"]
["New","Yes","Timeliness of Service","Program Delivery - Inconvenient","291 FILM COMPANY INC","ABORIGINAL RELATIONS & RECONCILIATION (MARR)","Alison Nordgren"]
["In Progress","No","Quality of Service","Program Delivery - Interruption","ACCESS POINT INFORMATION CANADA LTD","ACCESS POINT INFORMATION CANADA LTD","Allison Dunn"]
["Resolved",null,"Incomplete Service","Program Delivery - Shut Down","ADVANCED EDUCATION, SKILLS AND TRAINING","AG EXECUTIVE BRANCH","Carolynn Oliver"]
["Closed",null,"Customer Service","Health & Safety - Public","AGRICULTURE","AGELESS GARDENS PRODUCTIONS II INC","Dar Purewall"]
["Reviewed and Raised",null,"Other","Health & Safety - Staff","ALOUETTE RIVER MANAGEMENT SOCIETY","AGENCIES BOARDS COMMISSIONS&OTHER TRIBUNALS","Darrel Murphy"]
["Cancelled",null,null,"Health & Safety - All","ATTORNEY GENERAL","AGRICULTURAL LAND COMMISSION","Davy Mulligan"]
[null,null,null,"Citizen Impacting Issue","AUDITOR GENERAL FOR LOCAL GOVERNMENT","ALOUETTE RIVER MANAGEMENT SOCIETY","Elena Awchoula"]
[null,null,null,"Staff Concern","B C ASSESSMENT","ARTS, CULTURE AND SPORT","Joel Guno"]
[null,null,null,"Other","B C HYDRO","ASSET MANAGEMENT BRANCH","Mark Timmins"]
[null,null,null,null,"B C LOTTERY CORPORATION","AUDITOR GENERAL FOR LOCAL GOVERNMENT","Interior CPO"]
[null,null,null,null,"B C PUBLIC SERVICE AGENCY","B C ASSESSMENT","North CPO"]
[null,null,null,null,"BCNET","B C CENTRE FOR DISEASE CONTROL","Lower Mainland CPO"]
[null,null,null,null,"BELL CANADA","B C HYDRO","Vancouver Island CPO"]
[null,null,null,null,"BGIS WORKPLACE SOLUTIONS INC.","B C LOTTERY CORPORATION"]
[null,null,null,null,"BRITISH COLUMBIA FERRY SERVICES INC.","B C PUBLIC SERVICE AGENCY"]
[null,null,null,null,"BRITISH COLUMBIA PENSION CORPORATION","B C STATS"]
[null,null,null,null,"BRITISH COLUMBIA SAFETY AUTHORITY","B C UTILITIES COMMISSION"]
[null,null,null,null,"CANADIAN BROADCASTING CORPORATION","BC CORONERS SERVICE"]
[null,null,null,null,"CANAZWEST PICTURES INC","BC MENTAL HEALTH & SUBSTANCE USE SERVICES"]
[null,null,null,null,"CAPITAL REGIONAL DISTRICT","BC REGISTRY SERVICES"]
[null,null,null,null,"CHILDREN AND FAMILY DEVELOPMENT","BCNET"]
[null,null,null,null,"CITIZENS' SERVICES","BELL CANADA"]
[null,null,null,null,"CITY OF LANGFORD","BGIS WORKPLACE SOLUTIONS INC."]
[null,null,null,null,"CITY OF QUESNEL","BRITISH COLUMBIA EMERGENCY HEALTH SERVICES"]
[null,null,null,null,"CITY OF VANCOUVER","BRITISH COLUMBIA FERRY SERVICES INC."]
[null,null,null,null,"COLLINS BRANDLE PHYSIOTHERAPIST CORP","BRITISH COLUMBIA PENSION CORPORATION"]
[null,null,null,null,"COLUMBIA BASIN BROADBAND CORPORATION","BRITISH COLUMBIA SAFETY AUTHORITY"]
[null,null,null,null,"COLUMBIA KOOTENAY BROADCASTING CO LTD","BUSINESS RISK MANAGEMENT"]
[null,null,null,null,"COMMUNITY ARTS COUNCIL","C.O.A."]
[null,null,null,null,"COMMUNITY LIVING BRITISH COLUMBIA","CABINET OPERATIONS"]
[null,null,null,null,"DESTINATION BC","CANADIAN BROADCASTING CORPORATION"]
[null,null,null,null,"DISTRICT OF FORT ST JAMES","CANAZWEST PICTURES INC"]
[null,null,null,null,"DISTRICT OF SQUAMISH","CAPITAL REGIONAL DISTRICT"]
[null,null,null,null,"DOCTOR ALEX BARSS","CENTRAL"]
[null,null,null,null,"EDUCATION","CHILD CARE"]
[null,null,null,null,"ELIZABETH BAGSHAW WOMEN'S CLINIC","CITY OF LANGFORD"]
[null,null,null,null,"EMILY CARR UNIVERSITY OF ART AND DESIGN","CITY OF QUESNEL"]
[null,null,null,null,"ENERGY, MINES AND PETROLEUM RESOURCES","CLAIMS CENTRE"]
[null,null,null,null,"ENRIGHT, DON","COAST FRASER"]
[null,null,null,null,"ENVIRONMENT AND CLIMATE CHANGE STRATEGY","COAST NORTH SHORE"]
[null,null,null,null,"ENVIRONMENT CANADA","COLLINS BRANDLE PHYSIOTHERAPIST CORP"]
[null,null,null,null,"EVERYWOMAN'S HEALTH CENTRE","COLUMBIA BASIN BROADBAND CORPORATION"]
[null,null,null,null,"FINANCE","COLUMBIA KOOTENAY BROADCASTING CO LTD"]
[null,null,null,null,"FOREST PRACTICES BOARD","COMMUNITY ARTS COUNCIL"]
[null,null,null,null,"FORESTS, LANDS, NATURAL RESOURCE OPERATIONS AND RURAL DEVELOPMENT","COMMUNITY CORRECTIONS"]
[null,null,null,null,"FRASER HEALTH AUTHORITY","COMMUNITY SAFETY & CRIME PREVENTION - CF"]
[null,null,null,null,"GREATER VICTORIA HARBOUR AUTHORITY","COMMUNITY SAFETY & CRIME PREVENTION - VICTIM SERVICES"]
[null,null,null,null,"GREATER VICTORIA PUBLIC LIBRARY","CORPORATE"]
[null,null,null,null,"GREATER VICTORIA WOMEN'S SHELTER SOCIETY","CORPORATE INFORMATION & RECORDS MGMT OFFICE"]
[null,null,null,null,"HEALTH","CORPORATE MANAGEMENT SERVICES"]
[null,null,null,null,"IBM CANADA LTD","CORPORATE POLICY & PLANNING OFFICE"]
[null,null,null,null,"INDIGENOUS RELATIONS AND RECONCILIATION","CORPORATE PROGRAMS"]
[null,null,null,null,"INDUSTRY TRAINING AUTHORITY","CORPORATE SERVICES"]
[null,null,null,null,"INSURANCE CORPORATION OF BRITISH COLUMBIA","CORPORATE SERVICES AND FINANCIAL ACCOUNTABILITY"]
[null,null,null,null,"INTERIOR HEALTH AUTHORITY","CORPORATE SERVICES FOR THE NATURAL RESOURCES MINISTRIES"]
[null,null,null,null,"JAMES BAY MARKET SOCIETY","CORRECTIONS"]
[null,null,null,null,"JOBS, TRADE AND  TECHNOLOGY","CORRESPONDENCE BRANCH"]
[null,null,null,null,"KAMLOOPS FOOD POLICY COUNCIL","COURT SERVICES"]
[null,null,null,null,"LABOUR","CRIMINAL JUSTICE"]
{"$rows_left_out":158}